r63014 ruby 2.3.7p456 (2018-03-28) [powerpc-aix7.1.3.0] [2.3] (aix71_ppc) 413W [BUG] [SEGV] 0F1E failed(rubyspec CommandTimeout) 17failed(rubyspec/) failed(rubyspec/library/socket/socket/accept_spec.rb CommandTimeout) failed(rubyspec/library/socket/socket/sysaccept_spec.rb CommandTimeout) failed(dist)

chkbuild summary recent last

OlderDiff < 20180810T011211Z(failure) > NewerDiff > NewerLog

== test-all # 2018-08-09T19:18:56-07:00 (full)
...(snip 16539 lines)...
XMLRPC::ClientTest#test_new2_proxy_port = 0.00 s = .
XMLRPC::ClientTest#test_new2_slash_path = 0.00 s = .
XMLRPC::ClientTest#test_new2_ssl = 0.00 s = .
XMLRPC::ClientTest#test_new2_ssl_custom_port = 0.00 s = .
XMLRPC::ClientTest#test_new2_user_password = 0.00 s = .
XMLRPC::ClientTest#test_request = 0.02 s = .


Finished tests in 3120.658693s, 5.1717 tests/s, 717.3735 assertions/s.

  1) Error:
TestBugReporter#test_bug_reporter_add:
Timeout::Error: execution of assert_in_out_err expired
pid 63176814 killed by SIGABRT (signal 6)
| 
| -:1: [BUG] Segmentation fault at 0x00000000
| ruby 2.3.7p456 (2018-03-28 revision 63014) [powerpc-aix7.1.3.0]
| 
| -- Control frame information -----------------------------------------------
| c:0003 p:---- s:0009 e:000008 CFUNC  :kill
| c:0002 p:0023 s:0004 E:001fc0 EVAL   -:1 [FINISH]
| c:0001 p:0000 s:0002 E:001610 (none) [FINISH]
| 
| -- Ruby level backtrace information ----------------------------------------
| -:1:in `<main>'
| -:1:in `kill'
| 
| -- Other runtime information -----------------------------------------------
| 
| * Loaded script: -
| 
| * Loaded features:
| 
|     0 enumerator.so
|     1 thread.rb
|     2 rational.so
|     3 complex.so
|     4 /home/chkbuild/build/20180810T011211Z/ruby/.ext/powerpc-aix7.1.3.0/enc/encdb.so
|     5 /home/chkbuild/build/20180810T011211Z/ruby/.ext/powerpc-aix7.1.3.0/enc/trans/transdb.so
|     6 /home/chkbuild/build/20180810T011211Z/ruby/.ext/powerpc-aix7.1.3.0/enc/iso_8859_1.so
|     7 /home/chkbuild/build/20180810T011211Z/ruby/lib/unicode_normalize.rb
|     8 /home/chkbuild/build/20180810T011211Z/ruby/.ext/powerpc-aix7.1.3.0/-test-/bug_reporter/bug_reporter.so
| 
| Sample bug reporter: 12345
| [NOTE]
| You may have encountered a bug in the Ruby interpreter or extension libraries.
| Bug reports are welcome.
| For details: http://www.ruby-lang.org/bugreport.html
| 

    /home/chkbuild/build/20180810T011211Z/ruby/test/-ext-/bug_reporter/test_bug_reporter.rb:20:in `test_bug_reporter_add'

16139 tests, 2238678 assertions, 0 failures, 1 errors, 61 skips

ruby -v: ruby 2.3.7p456 (2018-03-28 revision 63014) [powerpc-aix7.1.3.0]
gmake: *** [yes-test-all] Error 1
exit 2
failed(test-all)
== rubyspec # 2018-08-09T20:11:08-07:00 (full)
...(snip 42376 lines)...
Socket#accept_nonblock using IPv6 using a bound socket that's listening with a connected client the returned Addrinfo
- uses AF_INET as the address family
- uses PF_INET as the protocol family
- uses SOCK_STREAM as the socket type
- uses 0 as the protocol
- uses the same IP address as the client Socket
- uses the same port as the client Socket

/home/chkbuild/build/20180810T011211Z/rubyspec/library/socket/socket/accept_spec.rb                                       
Socket#accept using IPv4 using an unbound socket
- raises Errno::EINVALtimeout: output interval exceeds 1800.0 seconds.
timeout: the process group 65863780 is alive.
PSOUT     PGID      PID     ELAPSED  %CPU   VSZ COMMAND  COMMAND
PSOUT 65863780 65863780       38:54   0.0 232568 ruby     /home/chkbuild/build/20180810T011211Z/mspec/bin/mspec-run
timeout: INT signal sent.
failed(rubyspec CommandTimeout)
== rubyspec/library/socket/addrinfo/getaddrinfo_spec.rb # 2018-08-09T21:23:55-07:00 (full)
...(snip 37 lines)...
SocketError: getaddrinfo: Hostname and service name not provided or found
/home/chkbuild/build/20180810T011211Z/rubyspec/library/socket/addrinfo/getaddrinfo_spec.rb:46:in `getaddrinfo'
/home/chkbuild/build/20180810T011211Z/rubyspec/library/socket/addrinfo/getaddrinfo_spec.rb:46:in `block (3 levels) in <top (required)>'
/home/chkbuild/build/20180810T011211Z/rubyspec/library/socket/addrinfo/getaddrinfo_spec.rb:4:in `<top (required)>'

Finished in 0.024330 seconds

1 file, 16 examples, 15 expectations, 0 failures, 2 errors, 0 tagged
exit 1
failed(rubyspec/library/socket/addrinfo/getaddrinfo_spec.rb)
== rubyspec/library/socket/addrinfo/initialize_spec.rb # 2018-08-09T21:24:00-07:00 (full)
...(snip 292 lines)...
/home/chkbuild/build/20180810T011211Z/rubyspec/library/socket/addrinfo/initialize_spec.rb:498:in `new'
/home/chkbuild/build/20180810T011211Z/rubyspec/library/socket/addrinfo/initialize_spec.rb:498:in `block (8 levels) in <top (required)>'
/home/chkbuild/build/20180810T011211Z/rubyspec/library/socket/addrinfo/initialize_spec.rb:500:in `block (7 levels) in <top (required)>'
/home/chkbuild/build/20180810T011211Z/rubyspec/library/socket/addrinfo/initialize_spec.rb:3:in `<top (required)>'

Finished in 0.062899 seconds

1 file, 208 examples, 244 expectations, 0 failures, 5 errors, 0 tagged
exit 1
failed(rubyspec/library/socket/addrinfo/initialize_spec.rb)
== rubyspec/library/socket/addrinfo/ipv6_linklocal_spec.rb # 2018-08-09T21:24:09-07:00 (full)
...(snip 14 lines)...
 to equal true

/home/chkbuild/build/20180810T011211Z/rubyspec/library/socket/addrinfo/ipv6_linklocal_spec.rb:6:in `block (2 levels) in <top (required)>'
/home/chkbuild/build/20180810T011211Z/rubyspec/library/socket/addrinfo/ipv6_linklocal_spec.rb:3:in `<top (required)>'

Finished in 0.009747 seconds

1 file, 3 examples, 4 expectations, 1 failure, 0 errors, 0 tagged
exit 1
failed(rubyspec/library/socket/addrinfo/ipv6_linklocal_spec.rb)
== rubyspec/library/socket/addrinfo/ipv6_sitelocal_spec.rb # 2018-08-09T21:24:17-07:00 (full)
...(snip 14 lines)...
 to equal true

/home/chkbuild/build/20180810T011211Z/rubyspec/library/socket/addrinfo/ipv6_sitelocal_spec.rb:5:in `block (2 levels) in <top (required)>'
/home/chkbuild/build/20180810T011211Z/rubyspec/library/socket/addrinfo/ipv6_sitelocal_spec.rb:3:in `<top (required)>'

Finished in 0.009991 seconds

1 file, 3 examples, 3 expectations, 1 failure, 0 errors, 0 tagged
exit 1
failed(rubyspec/library/socket/addrinfo/ipv6_sitelocal_spec.rb)
== rubyspec/library/socket/addrinfo/ipv6_to_ipv4_spec.rb # 2018-08-09T21:24:21-07:00 (full)
...(snip 30 lines)...
Addrinfo#ipv6_to_ipv4 returns an Addrinfo for ::0.1.0.0 FAILED
Expected nil (NilClass) to be an instance of Addrinfo
/home/chkbuild/build/20180810T011211Z/rubyspec/library/socket/addrinfo/ipv6_to_ipv4_spec.rb:34:in `block (2 levels) in <top (required)>'
/home/chkbuild/build/20180810T011211Z/rubyspec/library/socket/addrinfo/ipv6_to_ipv4_spec.rb:3:in `<top (required)>'

Finished in 0.010918 seconds

1 file, 9 examples, 13 expectations, 3 failures, 0 errors, 0 tagged
exit 1
failed(rubyspec/library/socket/addrinfo/ipv6_to_ipv4_spec.rb)
== rubyspec/library/socket/ancillarydata/cmsg_is_spec.rb # 2018-08-09T21:24:34-07:00 (full)
...(snip 16 lines)...
/home/chkbuild/build/20180810T011211Z/rubyspec/library/socket/ancillarydata/cmsg_is_spec.rb:19:in `cmsg_is?'
/home/chkbuild/build/20180810T011211Z/rubyspec/library/socket/ancillarydata/cmsg_is_spec.rb:19:in `block (4 levels) in <top (required)>'
/home/chkbuild/build/20180810T011211Z/rubyspec/library/socket/ancillarydata/cmsg_is_spec.rb:4:in `block in <top (required)>'
/home/chkbuild/build/20180810T011211Z/rubyspec/library/socket/ancillarydata/cmsg_is_spec.rb:3:in `<top (required)>'

Finished in 0.010088 seconds

1 file, 5 examples, 4 expectations, 0 failures, 1 error, 0 tagged
exit 1
failed(rubyspec/library/socket/ancillarydata/cmsg_is_spec.rb)
== rubyspec/library/socket/ancillarydata/initialize_spec.rb # 2018-08-09T21:24:39-07:00 (full)
...(snip 80 lines)...
/home/chkbuild/build/20180810T011211Z/rubyspec/library/socket/ancillarydata/initialize_spec.rb:110:in `new'
/home/chkbuild/build/20180810T011211Z/rubyspec/library/socket/ancillarydata/initialize_spec.rb:110:in `block (4 levels) in <top (required)>'
/home/chkbuild/build/20180810T011211Z/rubyspec/library/socket/ancillarydata/initialize_spec.rb:4:in `block in <top (required)>'
/home/chkbuild/build/20180810T011211Z/rubyspec/library/socket/ancillarydata/initialize_spec.rb:3:in `<top (required)>'

Finished in 0.016889 seconds

1 file, 40 examples, 39 expectations, 0 failures, 1 error, 0 tagged
exit 1
failed(rubyspec/library/socket/ancillarydata/initialize_spec.rb)
== rubyspec/library/socket/ancillarydata/ip_pktinfo_spec.rb # 2018-08-09T21:24:44-07:00 (full)
...(snip 209 lines)...
/home/chkbuild/build/20180810T011211Z/rubyspec/library/socket/ancillarydata/ip_pktinfo_spec.rb:121:in `ip_pktinfo'
/home/chkbuild/build/20180810T011211Z/rubyspec/library/socket/ancillarydata/ip_pktinfo_spec.rb:121:in `block (4 levels) in <top (required)>'
/home/chkbuild/build/20180810T011211Z/rubyspec/library/socket/ancillarydata/ip_pktinfo_spec.rb:52:in `block in <top (required)>'
/home/chkbuild/build/20180810T011211Z/rubyspec/library/socket/ancillarydata/ip_pktinfo_spec.rb:3:in `<top (required)>'

Finished in 0.013239 seconds

1 file, 0 examples, 0 expectations, 0 failures, 19 errors, 0 tagged
exit 1
failed(rubyspec/library/socket/ancillarydata/ip_pktinfo_spec.rb)
== rubyspec/library/socket/ancillarydata/unix_rights_spec.rb # 2018-08-09T21:24:50-07:00 (full)
...(snip 25 lines)...
/home/chkbuild/build/20180810T011211Z/rubyspec/library/socket/ancillarydata/unix_rights_spec.rb:54:in `new'
/home/chkbuild/build/20180810T011211Z/rubyspec/library/socket/ancillarydata/unix_rights_spec.rb:54:in `block (3 levels) in <top (required)>'
/home/chkbuild/build/20180810T011211Z/rubyspec/library/socket/ancillarydata/unix_rights_spec.rb:34:in `block in <top (required)>'
/home/chkbuild/build/20180810T011211Z/rubyspec/library/socket/ancillarydata/unix_rights_spec.rb:3:in `<top (required)>'

Finished in 0.010821 seconds

1 file, 9 examples, 8 expectations, 0 failures, 1 error, 0 tagged
exit 1
failed(rubyspec/library/socket/ancillarydata/unix_rights_spec.rb)
== rubyspec/library/socket/basicsocket/connect_address_spec.rb # 2018-08-09T21:24:55-07:00 (full)
...(snip 40 lines)...
Expected SocketError
but no exception was raised (#<Addrinfo: empty-sockaddr SOCK_STREAM> was returned)
/home/chkbuild/build/20180810T011211Z/rubyspec/library/socket/basicsocket/connect_address_spec.rb:110:in `block (4 levels) in <top (required)>'
/home/chkbuild/build/20180810T011211Z/rubyspec/library/socket/basicsocket/connect_address_spec.rb:4:in `<top (required)>'

Finished in 1.052456 seconds

1 file, 22 examples, 22 expectations, 1 failure, 0 errors, 0 tagged
exit 1
failed(rubyspec/library/socket/basicsocket/connect_address_spec.rb)
== rubyspec/library/socket/basicsocket/getsockopt_spec.rb # 2018-08-09T21:25:03-07:00 (full)
...(snip 35 lines)...
TypeError: size differ.  expected as sizeof(int)=4 but 256
/home/chkbuild/build/20180810T011211Z/rubyspec/library/socket/basicsocket/getsockopt_spec.rb:56:in `bool'
/home/chkbuild/build/20180810T011211Z/rubyspec/library/socket/basicsocket/getsockopt_spec.rb:56:in `block (2 levels) in <top (required)>'
/home/chkbuild/build/20180810T011211Z/rubyspec/library/socket/basicsocket/getsockopt_spec.rb:4:in `<top (required)>'

Finished in 0.014766 seconds

1 file, 19 examples, 46 expectations, 0 failures, 1 error, 0 tagged
exit 1
failed(rubyspec/library/socket/basicsocket/getsockopt_spec.rb)
== rubyspec/library/socket/basicsocket/setsockopt_spec.rb # 2018-08-09T21:25:11-07:00 (full)
...(snip 76 lines)...
TypeError: size differ.  expected as sizeof(int)=4 but 256
/home/chkbuild/build/20180810T011211Z/rubyspec/library/socket/basicsocket/setsockopt_spec.rb:330:in `bool'
/home/chkbuild/build/20180810T011211Z/rubyspec/library/socket/basicsocket/setsockopt_spec.rb:330:in `block (4 levels) in <top (required)>'
/home/chkbuild/build/20180810T011211Z/rubyspec/library/socket/basicsocket/setsockopt_spec.rb:215:in `<top (required)>'

Finished in 0.058043 seconds

1 file, 22 examples, 50 expectations, 0 failures, 5 errors, 0 tagged
exit 1
failed(rubyspec/library/socket/basicsocket/setsockopt_spec.rb)
== rubyspec/library/socket/constants/constants_spec.rb # 2018-08-09T21:25:16-07:00 (full)
...(snip 19 lines)...
Socket::Constants defines SCM options FAILED
Expected Socket::Constants to have constant 'SCM_CREDENTIALS' but it does not
/home/chkbuild/build/20180810T011211Z/rubyspec/library/socket/constants/constants_spec.rb:92:in `block (3 levels) in <top (required)>'
/home/chkbuild/build/20180810T011211Z/rubyspec/library/socket/constants/constants_spec.rb:4:in `<top (required)>'

Finished in 0.016021 seconds

1 file, 10 examples, 38 expectations, 1 failure, 0 errors, 0 tagged
exit 1
failed(rubyspec/library/socket/constants/constants_spec.rb)
== rubyspec/library/socket/socket/accept_spec.rb # 2018-08-09T21:25:27-07:00 (full)
+ bin/ruby mspec/bin/mspec -B /home/odaira/chkbuild/tmp/build/20180810T011211Z/rubyspec/default.mspec -V -f s -t /home/odaira/chkbuild/tmp/build/20180810T011211Z/bin/ruby rubyspec/library/socket/socket/accept_spec.rb
$ /home/odaira/chkbuild/tmp/build/20180810T011211Z/bin/ruby /home/chkbuild/build/20180810T011211Z/mspec/bin/mspec-run -B /home/odaira/chkbuild/tmp/build/20180810T011211Z/rubyspec/default.mspec -V -f s rubyspec/library/socket/socket/accept_spec.rb

/home/chkbuild/build/20180810T011211Z/rubyspec/library/socket/socket/accept_spec.rbruby 2.3.7p456 (2018-03-28 revision 63014) [powerpc-aix7.1.3.0]

Socket#accept using IPv4 using an unbound socket
- raises Errno::EINVALtimeout: output interval exceeds 1800.0 seconds.
timeout: the process group 64160110 is alive.
PSOUT     PGID      PID     ELAPSED  %CPU   VSZ COMMAND  COMMAND
PSOUT 64160110 64160110       30:00   0.0  5828 ruby     /home/odaira/chkbuild/tmp/build/20180810T011211Z/bin/ruby /home/chkbuild/build/20180810T011211Z/mspec/bin/mspec-run -B /home/odaira/chkbuild/tmp/build/20180810T011211Z/rubyspec/default.mspec -V -f s rubyspec/library/socket/socket/accept_spec.rb
timeout: INT signal sent.
failed(rubyspec/library/socket/socket/accept_spec.rb CommandTimeout)
== rubyspec/library/socket/socket/gethostbyaddr_spec.rb # 2018-08-09T21:58:06-07:00 (full)
...(snip 82 lines)...
SocketError: host not found
/home/chkbuild/build/20180810T011211Z/rubyspec/library/socket/socket/gethostbyaddr_spec.rb:110:in `gethostbyaddr'
/home/chkbuild/build/20180810T011211Z/rubyspec/library/socket/socket/gethostbyaddr_spec.rb:110:in `block (5 levels) in <top (required)>'
/home/chkbuild/build/20180810T011211Z/rubyspec/library/socket/socket/gethostbyaddr_spec.rb:5:in `<top (required)>'

Finished in 0.027870 seconds

1 file, 12 examples, 10 expectations, 0 failures, 7 errors, 0 tagged
exit 1
failed(rubyspec/library/socket/socket/gethostbyaddr_spec.rb)
== rubyspec/library/socket/socket/getifaddrs_spec.rb # 2018-08-09T21:58:11-07:00 (full)
...(snip 130 lines)...
NotImplementedError: getifaddrs() function is unimplemented on this machine
/home/chkbuild/build/20180810T011211Z/rubyspec/library/socket/socket/getifaddrs_spec.rb:5:in `getifaddrs'
/home/chkbuild/build/20180810T011211Z/rubyspec/library/socket/socket/getifaddrs_spec.rb:5:in `block (2 levels) in <top (required)>'
/home/chkbuild/build/20180810T011211Z/rubyspec/library/socket/socket/getifaddrs_spec.rb:3:in `<top (required)>'

Finished in 0.011558 seconds

1 file, 0 examples, 0 expectations, 0 failures, 13 errors, 0 tagged
exit 1
failed(rubyspec/library/socket/socket/getifaddrs_spec.rb)
== rubyspec/library/socket/socket/getnameinfo_spec.rb # 2018-08-09T21:58:15-07:00 (full)
...(snip 59 lines)...
/home/chkbuild/build/20180810T011211Z/rubyspec/library/socket/socket/getnameinfo_spec.rb:72:in `getnameinfo'
/home/chkbuild/build/20180810T011211Z/rubyspec/library/socket/socket/getnameinfo_spec.rb:72:in `block (4 levels) in <top (required)>'
/home/chkbuild/build/20180810T011211Z/rubyspec/library/socket/socket/getnameinfo_spec.rb:72:in `block (3 levels) in <top (required)>'
/home/chkbuild/build/20180810T011211Z/rubyspec/library/socket/socket/getnameinfo_spec.rb:65:in `<top (required)>'

Finished in 0.042258 seconds

1 file, 22 examples, 38 expectations, 0 failures, 1 error, 0 tagged
exit 1
failed(rubyspec/library/socket/socket/getnameinfo_spec.rb)
== rubyspec/library/socket/socket/sysaccept_spec.rb # 2018-08-09T21:58:29-07:00 (full)
+ bin/ruby mspec/bin/mspec -B /home/odaira/chkbuild/tmp/build/20180810T011211Z/rubyspec/default.mspec -V -f s -t /home/odaira/chkbuild/tmp/build/20180810T011211Z/bin/ruby rubyspec/library/socket/socket/sysaccept_spec.rb
$ /home/odaira/chkbuild/tmp/build/20180810T011211Z/bin/ruby /home/chkbuild/build/20180810T011211Z/mspec/bin/mspec-run -B /home/odaira/chkbuild/tmp/build/20180810T011211Z/rubyspec/default.mspec -V -f s rubyspec/library/socket/socket/sysaccept_spec.rb

/home/chkbuild/build/20180810T011211Z/rubyspec/library/socket/socket/sysaccept_spec.rbruby 2.3.7p456 (2018-03-28 revision 63014) [powerpc-aix7.1.3.0]

Socket#sysaccept using IPv4 using an unbound socket
- raises Errno::EINVALtimeout: output interval exceeds 1800.0 seconds.
timeout: the process group 59048210 is alive.
PSOUT     PGID      PID     ELAPSED  %CPU   VSZ COMMAND  COMMAND
PSOUT 59048210 59048210       30:01   0.0  5816 ruby     /home/odaira/chkbuild/tmp/build/20180810T011211Z/bin/ruby /home/chkbuild/build/20180810T011211Z/mspec/bin/mspec-run -B /home/odaira/chkbuild/tmp/build/20180810T011211Z/rubyspec/default.mspec -V -f s rubyspec/library/socket/socket/sysaccept_spec.rb
timeout: INT signal sent.
failed(rubyspec/library/socket/socket/sysaccept_spec.rb CommandTimeout)
== rubyspec/library/socket/unixsocket/local_address_spec.rb # 2018-08-09T22:29:01-07:00 (full)
...(snip 37 lines)...
/home/chkbuild/build/20180810T011211Z/rubyspec/library/socket/unixsocket/local_address_spec.rb:37:in `unix_path'
/home/chkbuild/build/20180810T011211Z/rubyspec/library/socket/unixsocket/local_address_spec.rb:37:in `block (4 levels) in <top (required)>'
/home/chkbuild/build/20180810T011211Z/rubyspec/library/socket/unixsocket/local_address_spec.rb:5:in `block in <top (required)>'
/home/chkbuild/build/20180810T011211Z/rubyspec/library/socket/unixsocket/local_address_spec.rb:4:in `<top (required)>'

Finished in 0.099898 seconds

1 file, 6 examples, 5 expectations, 2 failures, 1 error, 0 tagged
exit 1
failed(rubyspec/library/socket/unixsocket/local_address_spec.rb)
== dist # 2018-08-09T22:34:16-07:00 (full)
+ gmake RELNAME=branches/ruby_2_3@63014 AUTOCONF=autoconf dist
/home/odaira/pub/bin/ruby --disable=gems ./tool/make-snapshot -srcdir=. tmp branches/ruby_2_3@63014
Exporting branches/ruby_2_3@63014
svn: E175002: GET request on '/repos/ruby/!svn/rvr/53288/branches/ruby_2_3/ext/-test-/float/depend' failed: 408 Request Timeout
Export failed
gmake: *** [dist] Error 1
exit 2
failed(dist)

OlderDiff < 20180810T011211Z(failure) > NewerDiff > NewerLog


chkbuild summary recent last