r64149 ruby 2.4.5p315 (2018-07-31) [powerpc-aix7.1.3.0] [2.4] (aix71_ppc) 1278W 1F1E failed(rubyspec CommandTimeout) 17failed(rubyspec/) failed(rubyspec/library/socket/socket/accept_spec.rb CommandTimeout) failed(rubyspec/library/socket/socket/sysaccept_spec.rb CommandTimeout)

chkbuild summary recent last

OlderDiff < 20180809T201002Z(failure) > NewerDiff > NewerLog

== test-all # 2018-08-09T14:31:43-07:00 (full)
...(snip 13713 lines)...
[12693/17108] TestRDocParserC#test_initialize = 0.03 s
[12694/17108] TestRDocParserC#test_handle_method_args_2 = 0.03 s
[12695/17108] TestRDocParserC#test_load_variable_map_singleton = 0.03 s
[12696/17108] TestRDocParserC#test_load_variable_map_empty = 0.03 s
[12697/17108] TestRDocParserC#test_find_class_comment_define_class = 0.02 s
[12698/17108] TestRDocParserC#test_find_attr_comment_document_attr_overlaptimeout: INT signal sent.
/home/chkbuild/build/20180809T201002Z/ruby/test/rdoc/test_rdoc_parser_c.rb:62: warning: instance variable @tempfile not initialized

Interrupted

  1) Failure:
TestRDocOptions#test_parse_ignore_invalid_no [/home/chkbuild/build/20180809T201002Z/ruby/test/rdoc/test_rdoc_options.rb:419]:
[SystemExit] exception expected, not
Class: <Interrupt>
Message: <"">
---Backtrace---
/home/chkbuild/build/20180809T201002Z/ruby/lib/optparse.rb:785:in `block in update'
/home/chkbuild/build/20180809T201002Z/ruby/lib/optparse.rb:785:in `delete_if'
/home/chkbuild/build/20180809T201002Z/ruby/lib/optparse.rb:785:in `update'
/home/chkbuild/build/20180809T201002Z/ruby/lib/optparse.rb:817:in `append'
/home/chkbuild/build/20180809T201002Z/ruby/lib/optparse.rb:1512:in `separator'
/home/chkbuild/build/20180809T201002Z/ruby/lib/rdoc/options.rb:1023:in `block in parse'
/home/chkbuild/build/20180809T201002Z/ruby/lib/optparse.rb:1062:in `initialize'
/home/chkbuild/build/20180809T201002Z/ruby/lib/rdoc/options.rb:586:in `new'
/home/chkbuild/build/20180809T201002Z/ruby/lib/rdoc/options.rb:586:in `parse'
/home/chkbuild/build/20180809T201002Z/ruby/test/rdoc/test_rdoc_options.rb:420:in `block (2 levels) in test_parse_ignore_invalid_no'
---------------

  2) Error:
TestRDocParserC#test_find_attr_comment_document_attr_overlap:
NoMethodError: undefined method `close!' for nil:NilClass
    /home/chkbuild/build/20180809T201002Z/ruby/test/rdoc/test_rdoc_parser_c.rb:62:in `teardown'

Finished tests in 3597.337241s, 3.5123 tests/s, 460.3827 assertions/s.
12635 tests, 1656152 assertions, 1 failures, 1 errors, 46 skips
gmake: *** [yes-test-all] Error 1
failed(test-all CommandTimeout)
== rubyspec # 2018-08-09T15:31:52-07:00 (full)
...(snip 43015 lines)...
Socket#accept_nonblock using IPv6 using a bound socket that's listening with a connected client the returned Addrinfo
- uses AF_INET as the address family
- uses PF_INET as the protocol family
- uses SOCK_STREAM as the socket type
- uses 0 as the protocol
- uses the same IP address as the client Socket
- uses the same port as the client Socket

/home/chkbuild/build/20180809T201002Z/rubyspec/library/socket/socket/accept_spec.rb                                       
Socket#accept using IPv4 using an unbound socket
- raises Errno::EINVALtimeout: output interval exceeds 1800.0 seconds.
timeout: the process group 21758586 is alive.
PSOUT     PGID      PID     ELAPSED  %CPU   VSZ COMMAND  COMMAND
PSOUT 21758586 21758586       40:21   0.0 229328 ruby     /home/chkbuild/build/20180809T201002Z/mspec/bin/mspec-run
timeout: INT signal sent.
failed(rubyspec CommandTimeout)
== rubyspec/library/socket/addrinfo/getaddrinfo_spec.rb # 2018-08-09T16:48:52-07:00 (full)
...(snip 37 lines)...
SocketError: getaddrinfo: Hostname and service name not provided or found
/home/chkbuild/build/20180809T201002Z/rubyspec/library/socket/addrinfo/getaddrinfo_spec.rb:46:in `getaddrinfo'
/home/chkbuild/build/20180809T201002Z/rubyspec/library/socket/addrinfo/getaddrinfo_spec.rb:46:in `block (3 levels) in <top (required)>'
/home/chkbuild/build/20180809T201002Z/rubyspec/library/socket/addrinfo/getaddrinfo_spec.rb:4:in `<top (required)>'

Finished in 0.024225 seconds

1 file, 16 examples, 15 expectations, 0 failures, 2 errors, 0 tagged
exit 1
failed(rubyspec/library/socket/addrinfo/getaddrinfo_spec.rb)
== rubyspec/library/socket/addrinfo/initialize_spec.rb # 2018-08-09T16:48:56-07:00 (full)
...(snip 292 lines)...
/home/chkbuild/build/20180809T201002Z/rubyspec/library/socket/addrinfo/initialize_spec.rb:498:in `new'
/home/chkbuild/build/20180809T201002Z/rubyspec/library/socket/addrinfo/initialize_spec.rb:498:in `block (8 levels) in <top (required)>'
/home/chkbuild/build/20180809T201002Z/rubyspec/library/socket/addrinfo/initialize_spec.rb:500:in `block (7 levels) in <top (required)>'
/home/chkbuild/build/20180809T201002Z/rubyspec/library/socket/addrinfo/initialize_spec.rb:3:in `<top (required)>'

Finished in 0.062157 seconds

1 file, 208 examples, 244 expectations, 0 failures, 5 errors, 0 tagged
exit 1
failed(rubyspec/library/socket/addrinfo/initialize_spec.rb)
== rubyspec/library/socket/addrinfo/ipv6_linklocal_spec.rb # 2018-08-09T16:49:05-07:00 (full)
...(snip 14 lines)...
 to equal true

/home/chkbuild/build/20180809T201002Z/rubyspec/library/socket/addrinfo/ipv6_linklocal_spec.rb:6:in `block (2 levels) in <top (required)>'
/home/chkbuild/build/20180809T201002Z/rubyspec/library/socket/addrinfo/ipv6_linklocal_spec.rb:3:in `<top (required)>'

Finished in 0.008815 seconds

1 file, 3 examples, 4 expectations, 1 failure, 0 errors, 0 tagged
exit 1
failed(rubyspec/library/socket/addrinfo/ipv6_linklocal_spec.rb)
== rubyspec/library/socket/addrinfo/ipv6_sitelocal_spec.rb # 2018-08-09T16:49:12-07:00 (full)
...(snip 14 lines)...
 to equal true

/home/chkbuild/build/20180809T201002Z/rubyspec/library/socket/addrinfo/ipv6_sitelocal_spec.rb:5:in `block (2 levels) in <top (required)>'
/home/chkbuild/build/20180809T201002Z/rubyspec/library/socket/addrinfo/ipv6_sitelocal_spec.rb:3:in `<top (required)>'

Finished in 0.008708 seconds

1 file, 3 examples, 3 expectations, 1 failure, 0 errors, 0 tagged
exit 1
failed(rubyspec/library/socket/addrinfo/ipv6_sitelocal_spec.rb)
== rubyspec/library/socket/addrinfo/ipv6_to_ipv4_spec.rb # 2018-08-09T16:49:16-07:00 (full)
...(snip 30 lines)...
Addrinfo#ipv6_to_ipv4 returns an Addrinfo for ::0.1.0.0 FAILED
Expected nil (NilClass) to be an instance of Addrinfo
/home/chkbuild/build/20180809T201002Z/rubyspec/library/socket/addrinfo/ipv6_to_ipv4_spec.rb:34:in `block (2 levels) in <top (required)>'
/home/chkbuild/build/20180809T201002Z/rubyspec/library/socket/addrinfo/ipv6_to_ipv4_spec.rb:3:in `<top (required)>'

Finished in 0.009861 seconds

1 file, 9 examples, 13 expectations, 3 failures, 0 errors, 0 tagged
exit 1
failed(rubyspec/library/socket/addrinfo/ipv6_to_ipv4_spec.rb)
== rubyspec/library/socket/ancillarydata/cmsg_is_spec.rb # 2018-08-09T16:49:28-07:00 (full)
...(snip 16 lines)...
/home/chkbuild/build/20180809T201002Z/rubyspec/library/socket/ancillarydata/cmsg_is_spec.rb:19:in `cmsg_is?'
/home/chkbuild/build/20180809T201002Z/rubyspec/library/socket/ancillarydata/cmsg_is_spec.rb:19:in `block (4 levels) in <top (required)>'
/home/chkbuild/build/20180809T201002Z/rubyspec/library/socket/ancillarydata/cmsg_is_spec.rb:4:in `block in <top (required)>'
/home/chkbuild/build/20180809T201002Z/rubyspec/library/socket/ancillarydata/cmsg_is_spec.rb:3:in `<top (required)>'

Finished in 0.009002 seconds

1 file, 5 examples, 4 expectations, 0 failures, 1 error, 0 tagged
exit 1
failed(rubyspec/library/socket/ancillarydata/cmsg_is_spec.rb)
== rubyspec/library/socket/ancillarydata/initialize_spec.rb # 2018-08-09T16:49:33-07:00 (full)
...(snip 80 lines)...
/home/chkbuild/build/20180809T201002Z/rubyspec/library/socket/ancillarydata/initialize_spec.rb:110:in `new'
/home/chkbuild/build/20180809T201002Z/rubyspec/library/socket/ancillarydata/initialize_spec.rb:110:in `block (4 levels) in <top (required)>'
/home/chkbuild/build/20180809T201002Z/rubyspec/library/socket/ancillarydata/initialize_spec.rb:4:in `block in <top (required)>'
/home/chkbuild/build/20180809T201002Z/rubyspec/library/socket/ancillarydata/initialize_spec.rb:3:in `<top (required)>'

Finished in 0.016255 seconds

1 file, 40 examples, 39 expectations, 0 failures, 1 error, 0 tagged
exit 1
failed(rubyspec/library/socket/ancillarydata/initialize_spec.rb)
== rubyspec/library/socket/ancillarydata/ip_pktinfo_spec.rb # 2018-08-09T16:49:38-07:00 (full)
...(snip 209 lines)...
/home/chkbuild/build/20180809T201002Z/rubyspec/library/socket/ancillarydata/ip_pktinfo_spec.rb:121:in `ip_pktinfo'
/home/chkbuild/build/20180809T201002Z/rubyspec/library/socket/ancillarydata/ip_pktinfo_spec.rb:121:in `block (4 levels) in <top (required)>'
/home/chkbuild/build/20180809T201002Z/rubyspec/library/socket/ancillarydata/ip_pktinfo_spec.rb:52:in `block in <top (required)>'
/home/chkbuild/build/20180809T201002Z/rubyspec/library/socket/ancillarydata/ip_pktinfo_spec.rb:3:in `<top (required)>'

Finished in 0.012549 seconds

1 file, 0 examples, 0 expectations, 0 failures, 19 errors, 0 tagged
exit 1
failed(rubyspec/library/socket/ancillarydata/ip_pktinfo_spec.rb)
== rubyspec/library/socket/ancillarydata/unix_rights_spec.rb # 2018-08-09T16:49:44-07:00 (full)
...(snip 25 lines)...
/home/chkbuild/build/20180809T201002Z/rubyspec/library/socket/ancillarydata/unix_rights_spec.rb:54:in `new'
/home/chkbuild/build/20180809T201002Z/rubyspec/library/socket/ancillarydata/unix_rights_spec.rb:54:in `block (3 levels) in <top (required)>'
/home/chkbuild/build/20180809T201002Z/rubyspec/library/socket/ancillarydata/unix_rights_spec.rb:34:in `block in <top (required)>'
/home/chkbuild/build/20180809T201002Z/rubyspec/library/socket/ancillarydata/unix_rights_spec.rb:3:in `<top (required)>'

Finished in 0.009711 seconds

1 file, 9 examples, 8 expectations, 0 failures, 1 error, 0 tagged
exit 1
failed(rubyspec/library/socket/ancillarydata/unix_rights_spec.rb)
== rubyspec/library/socket/basicsocket/connect_address_spec.rb # 2018-08-09T16:49:49-07:00 (full)
...(snip 40 lines)...
Expected SocketError
but no exception was raised (#<Addrinfo: empty-sockaddr SOCK_STREAM> was returned)
/home/chkbuild/build/20180809T201002Z/rubyspec/library/socket/basicsocket/connect_address_spec.rb:110:in `block (4 levels) in <top (required)>'
/home/chkbuild/build/20180809T201002Z/rubyspec/library/socket/basicsocket/connect_address_spec.rb:4:in `<top (required)>'

Finished in 0.221215 seconds

1 file, 22 examples, 22 expectations, 1 failure, 0 errors, 0 tagged
exit 1
failed(rubyspec/library/socket/basicsocket/connect_address_spec.rb)
== rubyspec/library/socket/basicsocket/getsockopt_spec.rb # 2018-08-09T16:49:55-07:00 (full)
...(snip 35 lines)...
TypeError: size differ.  expected as sizeof(int)=4 but 256
/home/chkbuild/build/20180809T201002Z/rubyspec/library/socket/basicsocket/getsockopt_spec.rb:56:in `bool'
/home/chkbuild/build/20180809T201002Z/rubyspec/library/socket/basicsocket/getsockopt_spec.rb:56:in `block (2 levels) in <top (required)>'
/home/chkbuild/build/20180809T201002Z/rubyspec/library/socket/basicsocket/getsockopt_spec.rb:4:in `<top (required)>'

Finished in 0.013920 seconds

1 file, 19 examples, 46 expectations, 0 failures, 1 error, 0 tagged
exit 1
failed(rubyspec/library/socket/basicsocket/getsockopt_spec.rb)
== rubyspec/library/socket/basicsocket/setsockopt_spec.rb # 2018-08-09T16:50:03-07:00 (full)
...(snip 76 lines)...
TypeError: size differ.  expected as sizeof(int)=4 but 256
/home/chkbuild/build/20180809T201002Z/rubyspec/library/socket/basicsocket/setsockopt_spec.rb:330:in `bool'
/home/chkbuild/build/20180809T201002Z/rubyspec/library/socket/basicsocket/setsockopt_spec.rb:330:in `block (4 levels) in <top (required)>'
/home/chkbuild/build/20180809T201002Z/rubyspec/library/socket/basicsocket/setsockopt_spec.rb:215:in `<top (required)>'

Finished in 0.055335 seconds

1 file, 22 examples, 50 expectations, 0 failures, 5 errors, 0 tagged
exit 1
failed(rubyspec/library/socket/basicsocket/setsockopt_spec.rb)
== rubyspec/library/socket/constants/constants_spec.rb # 2018-08-09T16:50:08-07:00 (full)
...(snip 19 lines)...
Socket::Constants defines SCM options FAILED
Expected Socket::Constants to have constant 'SCM_CREDENTIALS' but it does not
/home/chkbuild/build/20180809T201002Z/rubyspec/library/socket/constants/constants_spec.rb:92:in `block (3 levels) in <top (required)>'
/home/chkbuild/build/20180809T201002Z/rubyspec/library/socket/constants/constants_spec.rb:4:in `<top (required)>'

Finished in 0.012664 seconds

1 file, 10 examples, 38 expectations, 1 failure, 0 errors, 0 tagged
exit 1
failed(rubyspec/library/socket/constants/constants_spec.rb)
== rubyspec/library/socket/socket/accept_spec.rb # 2018-08-09T16:50:18-07:00 (full)
+ bin/ruby mspec/bin/mspec -B /home/odaira/chkbuild/tmp/build/20180809T201002Z/rubyspec/default.mspec -V -f s -t /home/odaira/chkbuild/tmp/build/20180809T201002Z/bin/ruby rubyspec/library/socket/socket/accept_spec.rb
$ /home/odaira/chkbuild/tmp/build/20180809T201002Z/bin/ruby /home/chkbuild/build/20180809T201002Z/mspec/bin/mspec-run -B /home/odaira/chkbuild/tmp/build/20180809T201002Z/rubyspec/default.mspec -V -f s rubyspec/library/socket/socket/accept_spec.rb

/home/chkbuild/build/20180809T201002Z/rubyspec/library/socket/socket/accept_spec.rbruby 2.4.5p315 (2018-07-31 revision 64149) [powerpc-aix7.1.3.0]

Socket#accept using IPv4 using an unbound socket
- raises Errno::EINVALtimeout: output interval exceeds 1800.0 seconds.
timeout: the process group 55443580 is alive.
PSOUT     PGID      PID     ELAPSED  %CPU   VSZ COMMAND  COMMAND
PSOUT 55443580 55443580       30:01   0.0  4616 ruby     /home/odaira/chkbuild/tmp/build/20180809T201002Z/bin/ruby /home/chkbuild/build/20180809T201002Z/mspec/bin/mspec-run -B /home/odaira/chkbuild/tmp/build/20180809T201002Z/rubyspec/default.mspec -V -f s rubyspec/library/socket/socket/accept_spec.rb
timeout: INT signal sent.
failed(rubyspec/library/socket/socket/accept_spec.rb CommandTimeout)
== rubyspec/library/socket/socket/gethostbyaddr_spec.rb # 2018-08-09T17:22:57-07:00 (full)
...(snip 82 lines)...
SocketError: host not found
/home/chkbuild/build/20180809T201002Z/rubyspec/library/socket/socket/gethostbyaddr_spec.rb:110:in `gethostbyaddr'
/home/chkbuild/build/20180809T201002Z/rubyspec/library/socket/socket/gethostbyaddr_spec.rb:110:in `block (5 levels) in <top (required)>'
/home/chkbuild/build/20180809T201002Z/rubyspec/library/socket/socket/gethostbyaddr_spec.rb:5:in `<top (required)>'

Finished in 0.027524 seconds

1 file, 12 examples, 10 expectations, 0 failures, 7 errors, 0 tagged
exit 1
failed(rubyspec/library/socket/socket/gethostbyaddr_spec.rb)
== rubyspec/library/socket/socket/getifaddrs_spec.rb # 2018-08-09T17:23:02-07:00 (full)
...(snip 130 lines)...
NotImplementedError: getifaddrs() function is unimplemented on this machine
/home/chkbuild/build/20180809T201002Z/rubyspec/library/socket/socket/getifaddrs_spec.rb:5:in `getifaddrs'
/home/chkbuild/build/20180809T201002Z/rubyspec/library/socket/socket/getifaddrs_spec.rb:5:in `block (2 levels) in <top (required)>'
/home/chkbuild/build/20180809T201002Z/rubyspec/library/socket/socket/getifaddrs_spec.rb:3:in `<top (required)>'

Finished in 0.010763 seconds

1 file, 0 examples, 0 expectations, 0 failures, 13 errors, 0 tagged
exit 1
failed(rubyspec/library/socket/socket/getifaddrs_spec.rb)
== rubyspec/library/socket/socket/getnameinfo_spec.rb # 2018-08-09T17:23:06-07:00 (full)
...(snip 59 lines)...
/home/chkbuild/build/20180809T201002Z/rubyspec/library/socket/socket/getnameinfo_spec.rb:72:in `getnameinfo'
/home/chkbuild/build/20180809T201002Z/rubyspec/library/socket/socket/getnameinfo_spec.rb:72:in `block (4 levels) in <top (required)>'
/home/chkbuild/build/20180809T201002Z/rubyspec/library/socket/socket/getnameinfo_spec.rb:72:in `block (3 levels) in <top (required)>'
/home/chkbuild/build/20180809T201002Z/rubyspec/library/socket/socket/getnameinfo_spec.rb:65:in `<top (required)>'

Finished in 0.042763 seconds

1 file, 22 examples, 38 expectations, 0 failures, 1 error, 0 tagged
exit 1
failed(rubyspec/library/socket/socket/getnameinfo_spec.rb)
== rubyspec/library/socket/socket/sysaccept_spec.rb # 2018-08-09T17:23:19-07:00 (full)
+ bin/ruby mspec/bin/mspec -B /home/odaira/chkbuild/tmp/build/20180809T201002Z/rubyspec/default.mspec -V -f s -t /home/odaira/chkbuild/tmp/build/20180809T201002Z/bin/ruby rubyspec/library/socket/socket/sysaccept_spec.rb
$ /home/odaira/chkbuild/tmp/build/20180809T201002Z/bin/ruby /home/chkbuild/build/20180809T201002Z/mspec/bin/mspec-run -B /home/odaira/chkbuild/tmp/build/20180809T201002Z/rubyspec/default.mspec -V -f s rubyspec/library/socket/socket/sysaccept_spec.rb

/home/chkbuild/build/20180809T201002Z/rubyspec/library/socket/socket/sysaccept_spec.rbruby 2.4.5p315 (2018-07-31 revision 64149) [powerpc-aix7.1.3.0]

Socket#sysaccept using IPv4 using an unbound socket
- raises Errno::EINVALtimeout: output interval exceeds 1800.0 seconds.
timeout: the process group 38011280 is alive.
PSOUT     PGID      PID     ELAPSED  %CPU   VSZ COMMAND  COMMAND
PSOUT 38011280 38011280       30:01   0.0  4612 ruby     /home/odaira/chkbuild/tmp/build/20180809T201002Z/bin/ruby /home/chkbuild/build/20180809T201002Z/mspec/bin/mspec-run -B /home/odaira/chkbuild/tmp/build/20180809T201002Z/rubyspec/default.mspec -V -f s rubyspec/library/socket/socket/sysaccept_spec.rb
timeout: INT signal sent.
failed(rubyspec/library/socket/socket/sysaccept_spec.rb CommandTimeout)
== rubyspec/library/socket/unixsocket/local_address_spec.rb # 2018-08-09T17:53:50-07:00 (full)
...(snip 37 lines)...
/home/chkbuild/build/20180809T201002Z/rubyspec/library/socket/unixsocket/local_address_spec.rb:37:in `unix_path'
/home/chkbuild/build/20180809T201002Z/rubyspec/library/socket/unixsocket/local_address_spec.rb:37:in `block (4 levels) in <top (required)>'
/home/chkbuild/build/20180809T201002Z/rubyspec/library/socket/unixsocket/local_address_spec.rb:5:in `block in <top (required)>'
/home/chkbuild/build/20180809T201002Z/rubyspec/library/socket/unixsocket/local_address_spec.rb:4:in `<top (required)>'

Finished in 0.141235 seconds

1 file, 6 examples, 5 expectations, 2 failures, 1 error, 0 tagged
exit 1
failed(rubyspec/library/socket/unixsocket/local_address_spec.rb)

OlderDiff < 20180809T201002Z(failure) > NewerDiff > NewerLog


chkbuild summary recent last