r64195 ruby 2.5.2p66 (2018-08-05) [powerpc-aix7.1.3.0] [2.5] (aix71_ppc) 12437W [BUG] [SEGV] 1F1E failed(rubyspec CommandTimeout) 17failed(rubyspec/) failed(rubyspec/library/socket/socket/accept_spec.rb CommandTimeout) failed(rubyspec/library/socket/socket/sysaccept_spec.rb CommandTimeout)

chkbuild summary recent last

OlderDiff < 20180809T143200Z(failure) > NewerDiff > NewerLog

== test-all # 2018-08-09T09:20:53-07:00 (full)
...(snip 14248 lines)...
[14033/17471] TestRipper::Generic#test_parse_files:lib/rsstimeout: command execution time exceeds 3600.0 seconds.
timeout: the process group 26738970 is alive.
PSOUT     PGID      PID     ELAPSED  %CPU   VSZ COMMAND  COMMAND
PSOUT 26738970 26738970    01:00:00   0.0   960 make     gmake TESTS=--hide-skip -v RUBYOPT=-w test-all
PSOUT 26738970 14025296    01:00:00   0.2 387148 ruby     ./test/runner.rb: TestRipper::Generic#test_parse_files:lib/rss
PSOUT 26738970 21758600       00:00   0.0   440 ruby     [ruby]
timeout: INT signal sent.

Interrupted

  1) Failure:
TestRipper::Generic#test_parse_files:lib/rss [/home/chkbuild/build/20180809T143200Z/ruby/test/lib/zombie_hunter.rb:5]:
Expected [[21758600, #<Process::Status: pid 21758600 SIGINT (signal 2)>]] to be empty.

  2) Error:
TestBugReporter#test_bug_reporter_add:
Timeout::Error: execution of assert_in_out_err expired timeout (10 sec)
pid 43385112 killed by SIGABRT (signal 6)
| 
| -:1: [BUG] Segmentation fault at 0x00000000
| ruby 2.5.2p66 (2018-08-05 revision 64195) [powerpc-aix7.1.3.0]
| 
| -- Control frame information -----------------------------------------------
| c:0003 p:---- s:0012 e:000011 CFUNC  :kill
| c:0002 p:0021 s:0006 e:000005 EVAL   -:1 [FINISH]
| c:0001 p:0000 s:0003 E:001170 (none) [FINISH]
| 
| -- Ruby level backtrace information ----------------------------------------
| -:1:in `<main>'
| -:1:in `kill'
| 
| -- Other runtime information -----------------------------------------------
| 
| * Loaded script: -
| 
| * Loaded features:
| 
|     0 enumerator.so
|     1 thread.rb
|     2 rational.so
|     3 complex.so
|     4 /home/chkbuild/build/20180809T143200Z/ruby/.ext/powerpc-aix7.1.3.0/enc/encdb.so
|     5 /home/chkbuild/build/20180809T143200Z/ruby/.ext/powerpc-aix7.1.3.0/enc/trans/transdb.so
|     6 /home/chkbuild/build/20180809T143200Z/ruby/.ext/powerpc-aix7.1.3.0/enc/iso_8859_1.so
|     7 /home/chkbuild/build/20180809T143200Z/ruby/.ext/powerpc-aix7.1.3.0/-test-/bug_reporter.so
| 
| Sample bug reporter: 12345
| [NOTE]
| You may have encountered a bug in the Ruby interpreter or extension libraries.
| Bug reports are welcome.
| For details: http://www.ruby-lang.org/bugreport.html
| 

    /home/chkbuild/build/20180809T143200Z/ruby/test/-ext-/bug_reporter/test_bug_reporter.rb:20:in `test_bug_reporter_add'

Finished tests in 3591.341831s, 3.9036 tests/s, 585.7084 assertions/s.
14019 tests, 2103479 assertions, 1 failures, 1 errors, 28 skips
gmake: *** [yes-test-all] Error 1
failed(test-all CommandTimeout)
== rubyspec # 2018-08-09T10:20:58-07:00 (full)
...(snip 43365 lines)...
Socket#accept_nonblock using IPv6 using a bound socket that's listening with a connected client the returned Addrinfo
- uses AF_INET as the address family
- uses PF_INET as the protocol family
- uses SOCK_STREAM as the socket type
- uses 0 as the protocol
- uses the same IP address as the client Socket
- uses the same port as the client Socket

/home/chkbuild/build/20180809T143200Z/rubyspec/library/socket/socket/accept_spec.rb                                       
Socket#accept using IPv4 using an unbound socket
- raises Errno::EINVALtimeout: output interval exceeds 1800.0 seconds.
timeout: the process group 46465470 is alive.
PSOUT     PGID      PID     ELAPSED  %CPU   VSZ COMMAND  COMMAND
PSOUT 46465470 46465470       36:36   0.0 231164 ruby     /home/chkbuild/build/20180809T143200Z/mspec/bin/mspec-run
timeout: INT signal sent.
failed(rubyspec CommandTimeout)
== rubyspec/library/socket/addrinfo/getaddrinfo_spec.rb # 2018-08-09T11:32:23-07:00 (full)
...(snip 37 lines)...
SocketError: getaddrinfo: Hostname and service name not provided or found
/home/chkbuild/build/20180809T143200Z/rubyspec/library/socket/addrinfo/getaddrinfo_spec.rb:46:in `getaddrinfo'
/home/chkbuild/build/20180809T143200Z/rubyspec/library/socket/addrinfo/getaddrinfo_spec.rb:46:in `block (3 levels) in <top (required)>'
/home/chkbuild/build/20180809T143200Z/rubyspec/library/socket/addrinfo/getaddrinfo_spec.rb:4:in `<top (required)>'

Finished in 0.023215 seconds

1 file, 16 examples, 15 expectations, 0 failures, 2 errors, 0 tagged
exit 1
failed(rubyspec/library/socket/addrinfo/getaddrinfo_spec.rb)
== rubyspec/library/socket/addrinfo/initialize_spec.rb # 2018-08-09T11:32:28-07:00 (full)
...(snip 292 lines)...
/home/chkbuild/build/20180809T143200Z/rubyspec/library/socket/addrinfo/initialize_spec.rb:498:in `new'
/home/chkbuild/build/20180809T143200Z/rubyspec/library/socket/addrinfo/initialize_spec.rb:498:in `block (8 levels) in <top (required)>'
/home/chkbuild/build/20180809T143200Z/rubyspec/library/socket/addrinfo/initialize_spec.rb:500:in `block (7 levels) in <top (required)>'
/home/chkbuild/build/20180809T143200Z/rubyspec/library/socket/addrinfo/initialize_spec.rb:3:in `<top (required)>'

Finished in 0.059821 seconds

1 file, 208 examples, 244 expectations, 0 failures, 5 errors, 0 tagged
exit 1
failed(rubyspec/library/socket/addrinfo/initialize_spec.rb)
== rubyspec/library/socket/addrinfo/ipv6_linklocal_spec.rb # 2018-08-09T11:32:38-07:00 (full)
...(snip 14 lines)...
 to equal true

/home/chkbuild/build/20180809T143200Z/rubyspec/library/socket/addrinfo/ipv6_linklocal_spec.rb:6:in `block (2 levels) in <top (required)>'
/home/chkbuild/build/20180809T143200Z/rubyspec/library/socket/addrinfo/ipv6_linklocal_spec.rb:3:in `<top (required)>'

Finished in 0.008639 seconds

1 file, 3 examples, 4 expectations, 1 failure, 0 errors, 0 tagged
exit 1
failed(rubyspec/library/socket/addrinfo/ipv6_linklocal_spec.rb)
== rubyspec/library/socket/addrinfo/ipv6_sitelocal_spec.rb # 2018-08-09T11:32:46-07:00 (full)
...(snip 14 lines)...
 to equal true

/home/chkbuild/build/20180809T143200Z/rubyspec/library/socket/addrinfo/ipv6_sitelocal_spec.rb:5:in `block (2 levels) in <top (required)>'
/home/chkbuild/build/20180809T143200Z/rubyspec/library/socket/addrinfo/ipv6_sitelocal_spec.rb:3:in `<top (required)>'

Finished in 0.008751 seconds

1 file, 3 examples, 3 expectations, 1 failure, 0 errors, 0 tagged
exit 1
failed(rubyspec/library/socket/addrinfo/ipv6_sitelocal_spec.rb)
== rubyspec/library/socket/addrinfo/ipv6_to_ipv4_spec.rb # 2018-08-09T11:32:51-07:00 (full)
...(snip 30 lines)...
Addrinfo#ipv6_to_ipv4 returns an Addrinfo for ::0.1.0.0 FAILED
Expected nil (NilClass) to be an instance of Addrinfo
/home/chkbuild/build/20180809T143200Z/rubyspec/library/socket/addrinfo/ipv6_to_ipv4_spec.rb:34:in `block (2 levels) in <top (required)>'
/home/chkbuild/build/20180809T143200Z/rubyspec/library/socket/addrinfo/ipv6_to_ipv4_spec.rb:3:in `<top (required)>'

Finished in 0.009789 seconds

1 file, 9 examples, 13 expectations, 3 failures, 0 errors, 0 tagged
exit 1
failed(rubyspec/library/socket/addrinfo/ipv6_to_ipv4_spec.rb)
== rubyspec/library/socket/ancillarydata/cmsg_is_spec.rb # 2018-08-09T11:33:05-07:00 (full)
...(snip 16 lines)...
/home/chkbuild/build/20180809T143200Z/rubyspec/library/socket/ancillarydata/cmsg_is_spec.rb:19:in `cmsg_is?'
/home/chkbuild/build/20180809T143200Z/rubyspec/library/socket/ancillarydata/cmsg_is_spec.rb:19:in `block (4 levels) in <top (required)>'
/home/chkbuild/build/20180809T143200Z/rubyspec/library/socket/ancillarydata/cmsg_is_spec.rb:4:in `block in <top (required)>'
/home/chkbuild/build/20180809T143200Z/rubyspec/library/socket/ancillarydata/cmsg_is_spec.rb:3:in `<top (required)>'

Finished in 0.008570 seconds

1 file, 5 examples, 4 expectations, 0 failures, 1 error, 0 tagged
exit 1
failed(rubyspec/library/socket/ancillarydata/cmsg_is_spec.rb)
== rubyspec/library/socket/ancillarydata/initialize_spec.rb # 2018-08-09T11:33:10-07:00 (full)
...(snip 80 lines)...
/home/chkbuild/build/20180809T143200Z/rubyspec/library/socket/ancillarydata/initialize_spec.rb:110:in `new'
/home/chkbuild/build/20180809T143200Z/rubyspec/library/socket/ancillarydata/initialize_spec.rb:110:in `block (4 levels) in <top (required)>'
/home/chkbuild/build/20180809T143200Z/rubyspec/library/socket/ancillarydata/initialize_spec.rb:4:in `block in <top (required)>'
/home/chkbuild/build/20180809T143200Z/rubyspec/library/socket/ancillarydata/initialize_spec.rb:3:in `<top (required)>'

Finished in 0.017509 seconds

1 file, 40 examples, 39 expectations, 0 failures, 1 error, 0 tagged
exit 1
failed(rubyspec/library/socket/ancillarydata/initialize_spec.rb)
== rubyspec/library/socket/ancillarydata/ip_pktinfo_spec.rb # 2018-08-09T11:33:16-07:00 (full)
...(snip 209 lines)...
/home/chkbuild/build/20180809T143200Z/rubyspec/library/socket/ancillarydata/ip_pktinfo_spec.rb:121:in `ip_pktinfo'
/home/chkbuild/build/20180809T143200Z/rubyspec/library/socket/ancillarydata/ip_pktinfo_spec.rb:121:in `block (4 levels) in <top (required)>'
/home/chkbuild/build/20180809T143200Z/rubyspec/library/socket/ancillarydata/ip_pktinfo_spec.rb:52:in `block in <top (required)>'
/home/chkbuild/build/20180809T143200Z/rubyspec/library/socket/ancillarydata/ip_pktinfo_spec.rb:3:in `<top (required)>'

Finished in 0.012624 seconds

1 file, 0 examples, 0 expectations, 0 failures, 19 errors, 0 tagged
exit 1
failed(rubyspec/library/socket/ancillarydata/ip_pktinfo_spec.rb)
== rubyspec/library/socket/ancillarydata/unix_rights_spec.rb # 2018-08-09T11:33:23-07:00 (full)
...(snip 25 lines)...
/home/chkbuild/build/20180809T143200Z/rubyspec/library/socket/ancillarydata/unix_rights_spec.rb:54:in `new'
/home/chkbuild/build/20180809T143200Z/rubyspec/library/socket/ancillarydata/unix_rights_spec.rb:54:in `block (3 levels) in <top (required)>'
/home/chkbuild/build/20180809T143200Z/rubyspec/library/socket/ancillarydata/unix_rights_spec.rb:34:in `block in <top (required)>'
/home/chkbuild/build/20180809T143200Z/rubyspec/library/socket/ancillarydata/unix_rights_spec.rb:3:in `<top (required)>'

Finished in 0.010133 seconds

1 file, 9 examples, 8 expectations, 0 failures, 1 error, 0 tagged
exit 1
failed(rubyspec/library/socket/ancillarydata/unix_rights_spec.rb)
== rubyspec/library/socket/basicsocket/connect_address_spec.rb # 2018-08-09T11:33:29-07:00 (full)
...(snip 40 lines)...
Expected SocketError
but no exception was raised (#<Addrinfo: empty-sockaddr SOCK_STREAM> was returned)
/home/chkbuild/build/20180809T143200Z/rubyspec/library/socket/basicsocket/connect_address_spec.rb:110:in `block (4 levels) in <top (required)>'
/home/chkbuild/build/20180809T143200Z/rubyspec/library/socket/basicsocket/connect_address_spec.rb:4:in `<top (required)>'

Finished in 0.329061 seconds

1 file, 22 examples, 22 expectations, 1 failure, 0 errors, 0 tagged
exit 1
failed(rubyspec/library/socket/basicsocket/connect_address_spec.rb)
== rubyspec/library/socket/basicsocket/getsockopt_spec.rb # 2018-08-09T11:33:37-07:00 (full)
...(snip 35 lines)...
TypeError: size differ.  expected as sizeof(int)=4 but 256
/home/chkbuild/build/20180809T143200Z/rubyspec/library/socket/basicsocket/getsockopt_spec.rb:56:in `bool'
/home/chkbuild/build/20180809T143200Z/rubyspec/library/socket/basicsocket/getsockopt_spec.rb:56:in `block (2 levels) in <top (required)>'
/home/chkbuild/build/20180809T143200Z/rubyspec/library/socket/basicsocket/getsockopt_spec.rb:4:in `<top (required)>'

Finished in 0.013926 seconds

1 file, 19 examples, 46 expectations, 0 failures, 1 error, 0 tagged
exit 1
failed(rubyspec/library/socket/basicsocket/getsockopt_spec.rb)
== rubyspec/library/socket/basicsocket/setsockopt_spec.rb # 2018-08-09T11:33:46-07:00 (full)
...(snip 76 lines)...
TypeError: size differ.  expected as sizeof(int)=4 but 256
/home/chkbuild/build/20180809T143200Z/rubyspec/library/socket/basicsocket/setsockopt_spec.rb:330:in `bool'
/home/chkbuild/build/20180809T143200Z/rubyspec/library/socket/basicsocket/setsockopt_spec.rb:330:in `block (4 levels) in <top (required)>'
/home/chkbuild/build/20180809T143200Z/rubyspec/library/socket/basicsocket/setsockopt_spec.rb:215:in `<top (required)>'

Finished in 0.065357 seconds

1 file, 22 examples, 50 expectations, 0 failures, 5 errors, 0 tagged
exit 1
failed(rubyspec/library/socket/basicsocket/setsockopt_spec.rb)
== rubyspec/library/socket/constants/constants_spec.rb # 2018-08-09T11:33:51-07:00 (full)
...(snip 19 lines)...
Socket::Constants defines SCM options FAILED
Expected Socket::Constants to have constant 'SCM_CREDENTIALS' but it does not
/home/chkbuild/build/20180809T143200Z/rubyspec/library/socket/constants/constants_spec.rb:92:in `block (3 levels) in <top (required)>'
/home/chkbuild/build/20180809T143200Z/rubyspec/library/socket/constants/constants_spec.rb:4:in `<top (required)>'

Finished in 0.012917 seconds

1 file, 10 examples, 38 expectations, 1 failure, 0 errors, 0 tagged
exit 1
failed(rubyspec/library/socket/constants/constants_spec.rb)
== rubyspec/library/socket/socket/accept_spec.rb # 2018-08-09T11:34:03-07:00 (full)
+ bin/ruby mspec/bin/mspec -B /home/odaira/chkbuild/tmp/build/20180809T143200Z/rubyspec/default.mspec -V -f s -t /home/odaira/chkbuild/tmp/build/20180809T143200Z/bin/ruby rubyspec/library/socket/socket/accept_spec.rb
$ /home/odaira/chkbuild/tmp/build/20180809T143200Z/bin/ruby /home/chkbuild/build/20180809T143200Z/mspec/bin/mspec-run -B /home/odaira/chkbuild/tmp/build/20180809T143200Z/rubyspec/default.mspec -V -f s rubyspec/library/socket/socket/accept_spec.rb

/home/chkbuild/build/20180809T143200Z/rubyspec/library/socket/socket/accept_spec.rbruby 2.5.2p66 (2018-08-05 revision 64195) [powerpc-aix7.1.3.0]

Socket#accept using IPv4 using an unbound socket
- raises Errno::EINVALtimeout: output interval exceeds 1800.0 seconds.
timeout: the process group 852766 is alive.
PSOUT     PGID      PID     ELAPSED  %CPU   VSZ COMMAND  COMMAND
PSOUT   852766   852766       30:01   0.0  5196 ruby     /home/odaira/chkbuild/tmp/build/20180809T143200Z/bin/ruby /home/chkbuild/build/20180809T143200Z/mspec/bin/mspec-run -B /home/odaira/chkbuild/tmp/build/20180809T143200Z/rubyspec/default.mspec -V -f s rubyspec/library/socket/socket/accept_spec.rb
timeout: INT signal sent.
failed(rubyspec/library/socket/socket/accept_spec.rb CommandTimeout)
== rubyspec/library/socket/socket/gethostbyaddr_spec.rb # 2018-08-09T12:06:44-07:00 (full)
...(snip 82 lines)...
SocketError: host not found
/home/chkbuild/build/20180809T143200Z/rubyspec/library/socket/socket/gethostbyaddr_spec.rb:110:in `gethostbyaddr'
/home/chkbuild/build/20180809T143200Z/rubyspec/library/socket/socket/gethostbyaddr_spec.rb:110:in `block (5 levels) in <top (required)>'
/home/chkbuild/build/20180809T143200Z/rubyspec/library/socket/socket/gethostbyaddr_spec.rb:5:in `<top (required)>'

Finished in 0.029740 seconds

1 file, 12 examples, 10 expectations, 0 failures, 7 errors, 0 tagged
exit 1
failed(rubyspec/library/socket/socket/gethostbyaddr_spec.rb)
== rubyspec/library/socket/socket/getifaddrs_spec.rb # 2018-08-09T12:06:50-07:00 (full)
...(snip 130 lines)...
NotImplementedError: getifaddrs() function is unimplemented on this machine
/home/chkbuild/build/20180809T143200Z/rubyspec/library/socket/socket/getifaddrs_spec.rb:5:in `getifaddrs'
/home/chkbuild/build/20180809T143200Z/rubyspec/library/socket/socket/getifaddrs_spec.rb:5:in `block (2 levels) in <top (required)>'
/home/chkbuild/build/20180809T143200Z/rubyspec/library/socket/socket/getifaddrs_spec.rb:3:in `<top (required)>'

Finished in 0.011038 seconds

1 file, 0 examples, 0 expectations, 0 failures, 13 errors, 0 tagged
exit 1
failed(rubyspec/library/socket/socket/getifaddrs_spec.rb)
== rubyspec/library/socket/socket/getnameinfo_spec.rb # 2018-08-09T12:06:54-07:00 (full)
...(snip 59 lines)...
/home/chkbuild/build/20180809T143200Z/rubyspec/library/socket/socket/getnameinfo_spec.rb:72:in `getnameinfo'
/home/chkbuild/build/20180809T143200Z/rubyspec/library/socket/socket/getnameinfo_spec.rb:72:in `block (4 levels) in <top (required)>'
/home/chkbuild/build/20180809T143200Z/rubyspec/library/socket/socket/getnameinfo_spec.rb:72:in `block (3 levels) in <top (required)>'
/home/chkbuild/build/20180809T143200Z/rubyspec/library/socket/socket/getnameinfo_spec.rb:65:in `<top (required)>'

Finished in 0.043216 seconds

1 file, 22 examples, 38 expectations, 0 failures, 1 error, 0 tagged
exit 1
failed(rubyspec/library/socket/socket/getnameinfo_spec.rb)
== rubyspec/library/socket/socket/sysaccept_spec.rb # 2018-08-09T12:07:09-07:00 (full)
+ bin/ruby mspec/bin/mspec -B /home/odaira/chkbuild/tmp/build/20180809T143200Z/rubyspec/default.mspec -V -f s -t /home/odaira/chkbuild/tmp/build/20180809T143200Z/bin/ruby rubyspec/library/socket/socket/sysaccept_spec.rb
$ /home/odaira/chkbuild/tmp/build/20180809T143200Z/bin/ruby /home/chkbuild/build/20180809T143200Z/mspec/bin/mspec-run -B /home/odaira/chkbuild/tmp/build/20180809T143200Z/rubyspec/default.mspec -V -f s rubyspec/library/socket/socket/sysaccept_spec.rb

/home/chkbuild/build/20180809T143200Z/rubyspec/library/socket/socket/sysaccept_spec.rbruby 2.5.2p66 (2018-08-05 revision 64195) [powerpc-aix7.1.3.0]

Socket#sysaccept using IPv4 using an unbound socket
- raises Errno::EINVALtimeout: output interval exceeds 1800.0 seconds.
timeout: the process group 43385228 is alive.
PSOUT     PGID      PID     ELAPSED  %CPU   VSZ COMMAND  COMMAND
PSOUT 43385228 43385228       30:01   0.0  5188 ruby     /home/odaira/chkbuild/tmp/build/20180809T143200Z/bin/ruby /home/chkbuild/build/20180809T143200Z/mspec/bin/mspec-run -B /home/odaira/chkbuild/tmp/build/20180809T143200Z/rubyspec/default.mspec -V -f s rubyspec/library/socket/socket/sysaccept_spec.rb
timeout: INT signal sent.
failed(rubyspec/library/socket/socket/sysaccept_spec.rb CommandTimeout)
== rubyspec/library/socket/unixsocket/local_address_spec.rb # 2018-08-09T12:37:45-07:00 (full)
...(snip 37 lines)...
/home/chkbuild/build/20180809T143200Z/rubyspec/library/socket/unixsocket/local_address_spec.rb:37:in `unix_path'
/home/chkbuild/build/20180809T143200Z/rubyspec/library/socket/unixsocket/local_address_spec.rb:37:in `block (4 levels) in <top (required)>'
/home/chkbuild/build/20180809T143200Z/rubyspec/library/socket/unixsocket/local_address_spec.rb:5:in `block in <top (required)>'
/home/chkbuild/build/20180809T143200Z/rubyspec/library/socket/unixsocket/local_address_spec.rb:4:in `<top (required)>'

Finished in 0.167321 seconds

1 file, 6 examples, 5 expectations, 2 failures, 1 error, 0 tagged
exit 1
failed(rubyspec/library/socket/unixsocket/local_address_spec.rb)

OlderDiff < 20180809T143200Z(failure) > NewerDiff > NewerLog


chkbuild summary recent last