r63014 ruby 2.3.7p456 (2018-03-28) [x86_64-linux] [2.3] (debian8) 231W failed(test-all) 91failed(test/) rubyspec:0F2E

chkbuild summary recent last

20180810T102846Z(failure) < OlderDiff < 20180810T132833Z(failure) > NewerDiff > 20180810T162803Z(failure)

== test-all # 2018-08-10T22:36:56+09:00 (full)
...(snip 14 lines)...
Thread model: posix
gcc version 4.9.2 (Debian 4.9.2-10+deb8u1) 
/home/hsbt/chkbuild/tmp/build/20180810T132833Z/ruby/test/lib/iseq_loader_checker.rb:60: warning: assigned but unused variable - e
/home/hsbt/chkbuild/tmp/build/20180810T132833Z/ruby/test/lib/iseq_loader_checker.rb:46: warning: assigned but unused variable - i2_ary
./test/runner.rb:33:in `require': cannot load such file -- simplecov (LoadError)
	from ./test/runner.rb:33:in `<main>'
uncommon.mk:605: recipe for target 'yes-test-all' failed
make: *** [yes-test-all] Error 1
exit 2
failed(test-all)
== test/-ext- # 2018-08-10T22:36:57+09:00 (full)
...(snip 14 lines)...
Thread model: posix
gcc version 4.9.2 (Debian 4.9.2-10+deb8u1) 
/home/hsbt/chkbuild/tmp/build/20180810T132833Z/ruby/test/lib/iseq_loader_checker.rb:60: warning: assigned but unused variable - e
/home/hsbt/chkbuild/tmp/build/20180810T132833Z/ruby/test/lib/iseq_loader_checker.rb:46: warning: assigned but unused variable - i2_ary
./test/runner.rb:33:in `require': cannot load such file -- simplecov (LoadError)
	from ./test/runner.rb:33:in `<main>'
uncommon.mk:605: recipe for target 'yes-test-all' failed
make: *** [yes-test-all] Error 1
exit 2
failed(test/-ext-)
== test/base64 # 2018-08-10T22:36:58+09:00 (full)
...(snip 14 lines)...
Thread model: posix
gcc version 4.9.2 (Debian 4.9.2-10+deb8u1) 
/home/hsbt/chkbuild/tmp/build/20180810T132833Z/ruby/test/lib/iseq_loader_checker.rb:60: warning: assigned but unused variable - e
/home/hsbt/chkbuild/tmp/build/20180810T132833Z/ruby/test/lib/iseq_loader_checker.rb:46: warning: assigned but unused variable - i2_ary
./test/runner.rb:33:in `require': cannot load such file -- simplecov (LoadError)
	from ./test/runner.rb:33:in `<main>'
uncommon.mk:605: recipe for target 'yes-test-all' failed
make: *** [yes-test-all] Error 1
exit 2
failed(test/base64)
== test/benchmark # 2018-08-10T22:36:58+09:00 (full)
...(snip 14 lines)...
Thread model: posix
gcc version 4.9.2 (Debian 4.9.2-10+deb8u1) 
/home/hsbt/chkbuild/tmp/build/20180810T132833Z/ruby/test/lib/iseq_loader_checker.rb:60: warning: assigned but unused variable - e
/home/hsbt/chkbuild/tmp/build/20180810T132833Z/ruby/test/lib/iseq_loader_checker.rb:46: warning: assigned but unused variable - i2_ary
./test/runner.rb:33:in `require': cannot load such file -- simplecov (LoadError)
	from ./test/runner.rb:33:in `<main>'
uncommon.mk:605: recipe for target 'yes-test-all' failed
make: *** [yes-test-all] Error 1
exit 2
failed(test/benchmark)
== test/bigdecimal # 2018-08-10T22:36:59+09:00 (full)
...(snip 14 lines)...
Thread model: posix
gcc version 4.9.2 (Debian 4.9.2-10+deb8u1) 
/home/hsbt/chkbuild/tmp/build/20180810T132833Z/ruby/test/lib/iseq_loader_checker.rb:60: warning: assigned but unused variable - e
/home/hsbt/chkbuild/tmp/build/20180810T132833Z/ruby/test/lib/iseq_loader_checker.rb:46: warning: assigned but unused variable - i2_ary
./test/runner.rb:33:in `require': cannot load such file -- simplecov (LoadError)
	from ./test/runner.rb:33:in `<main>'
uncommon.mk:605: recipe for target 'yes-test-all' failed
make: *** [yes-test-all] Error 1
exit 2
failed(test/bigdecimal)
== test/cgi # 2018-08-10T22:37:00+09:00 (full)
...(snip 14 lines)...
Thread model: posix
gcc version 4.9.2 (Debian 4.9.2-10+deb8u1) 
/home/hsbt/chkbuild/tmp/build/20180810T132833Z/ruby/test/lib/iseq_loader_checker.rb:60: warning: assigned but unused variable - e
/home/hsbt/chkbuild/tmp/build/20180810T132833Z/ruby/test/lib/iseq_loader_checker.rb:46: warning: assigned but unused variable - i2_ary
./test/runner.rb:33:in `require': cannot load such file -- simplecov (LoadError)
	from ./test/runner.rb:33:in `<main>'
uncommon.mk:605: recipe for target 'yes-test-all' failed
make: *** [yes-test-all] Error 1
exit 2
failed(test/cgi)
== test/coverage # 2018-08-10T22:37:01+09:00 (full)
...(snip 14 lines)...
Thread model: posix
gcc version 4.9.2 (Debian 4.9.2-10+deb8u1) 
/home/hsbt/chkbuild/tmp/build/20180810T132833Z/ruby/test/lib/iseq_loader_checker.rb:60: warning: assigned but unused variable - e
/home/hsbt/chkbuild/tmp/build/20180810T132833Z/ruby/test/lib/iseq_loader_checker.rb:46: warning: assigned but unused variable - i2_ary
./test/runner.rb:33:in `require': cannot load such file -- simplecov (LoadError)
	from ./test/runner.rb:33:in `<main>'
uncommon.mk:605: recipe for target 'yes-test-all' failed
make: *** [yes-test-all] Error 1
exit 2
failed(test/coverage)
== test/csv # 2018-08-10T22:37:02+09:00 (full)
...(snip 14 lines)...
Thread model: posix
gcc version 4.9.2 (Debian 4.9.2-10+deb8u1) 
/home/hsbt/chkbuild/tmp/build/20180810T132833Z/ruby/test/lib/iseq_loader_checker.rb:60: warning: assigned but unused variable - e
/home/hsbt/chkbuild/tmp/build/20180810T132833Z/ruby/test/lib/iseq_loader_checker.rb:46: warning: assigned but unused variable - i2_ary
./test/runner.rb:33:in `require': cannot load such file -- simplecov (LoadError)
	from ./test/runner.rb:33:in `<main>'
uncommon.mk:605: recipe for target 'yes-test-all' failed
make: *** [yes-test-all] Error 1
exit 2
failed(test/csv)
== test/date # 2018-08-10T22:37:03+09:00 (full)
...(snip 14 lines)...
Thread model: posix
gcc version 4.9.2 (Debian 4.9.2-10+deb8u1) 
/home/hsbt/chkbuild/tmp/build/20180810T132833Z/ruby/test/lib/iseq_loader_checker.rb:60: warning: assigned but unused variable - e
/home/hsbt/chkbuild/tmp/build/20180810T132833Z/ruby/test/lib/iseq_loader_checker.rb:46: warning: assigned but unused variable - i2_ary
./test/runner.rb:33:in `require': cannot load such file -- simplecov (LoadError)
	from ./test/runner.rb:33:in `<main>'
uncommon.mk:605: recipe for target 'yes-test-all' failed
make: *** [yes-test-all] Error 1
exit 2
failed(test/date)
== test/dbm # 2018-08-10T22:37:04+09:00 (full)
...(snip 14 lines)...
Thread model: posix
gcc version 4.9.2 (Debian 4.9.2-10+deb8u1) 
/home/hsbt/chkbuild/tmp/build/20180810T132833Z/ruby/test/lib/iseq_loader_checker.rb:60: warning: assigned but unused variable - e
/home/hsbt/chkbuild/tmp/build/20180810T132833Z/ruby/test/lib/iseq_loader_checker.rb:46: warning: assigned but unused variable - i2_ary
./test/runner.rb:33:in `require': cannot load such file -- simplecov (LoadError)
	from ./test/runner.rb:33:in `<main>'
uncommon.mk:605: recipe for target 'yes-test-all' failed
make: *** [yes-test-all] Error 1
exit 2
failed(test/dbm)
== test/digest # 2018-08-10T22:37:05+09:00 (full)
...(snip 14 lines)...
Thread model: posix
gcc version 4.9.2 (Debian 4.9.2-10+deb8u1) 
/home/hsbt/chkbuild/tmp/build/20180810T132833Z/ruby/test/lib/iseq_loader_checker.rb:60: warning: assigned but unused variable - e
/home/hsbt/chkbuild/tmp/build/20180810T132833Z/ruby/test/lib/iseq_loader_checker.rb:46: warning: assigned but unused variable - i2_ary
./test/runner.rb:33:in `require': cannot load such file -- simplecov (LoadError)
	from ./test/runner.rb:33:in `<main>'
uncommon.mk:605: recipe for target 'yes-test-all' failed
make: *** [yes-test-all] Error 1
exit 2
failed(test/digest)
== test/dl # 2018-08-10T22:37:05+09:00 (full)
...(snip 14 lines)...
Thread model: posix
gcc version 4.9.2 (Debian 4.9.2-10+deb8u1) 
/home/hsbt/chkbuild/tmp/build/20180810T132833Z/ruby/test/lib/iseq_loader_checker.rb:60: warning: assigned but unused variable - e
/home/hsbt/chkbuild/tmp/build/20180810T132833Z/ruby/test/lib/iseq_loader_checker.rb:46: warning: assigned but unused variable - i2_ary
./test/runner.rb:33:in `require': cannot load such file -- simplecov (LoadError)
	from ./test/runner.rb:33:in `<main>'
uncommon.mk:605: recipe for target 'yes-test-all' failed
make: *** [yes-test-all] Error 1
exit 2
failed(test/dl)
== test/drb # 2018-08-10T22:37:06+09:00 (full)
...(snip 14 lines)...
Thread model: posix
gcc version 4.9.2 (Debian 4.9.2-10+deb8u1) 
/home/hsbt/chkbuild/tmp/build/20180810T132833Z/ruby/test/lib/iseq_loader_checker.rb:60: warning: assigned but unused variable - e
/home/hsbt/chkbuild/tmp/build/20180810T132833Z/ruby/test/lib/iseq_loader_checker.rb:46: warning: assigned but unused variable - i2_ary
./test/runner.rb:33:in `require': cannot load such file -- simplecov (LoadError)
	from ./test/runner.rb:33:in `<main>'
uncommon.mk:605: recipe for target 'yes-test-all' failed
make: *** [yes-test-all] Error 1
exit 2
failed(test/drb)
== test/dtrace # 2018-08-10T22:37:07+09:00 (full)
...(snip 14 lines)...
Thread model: posix
gcc version 4.9.2 (Debian 4.9.2-10+deb8u1) 
/home/hsbt/chkbuild/tmp/build/20180810T132833Z/ruby/test/lib/iseq_loader_checker.rb:60: warning: assigned but unused variable - e
/home/hsbt/chkbuild/tmp/build/20180810T132833Z/ruby/test/lib/iseq_loader_checker.rb:46: warning: assigned but unused variable - i2_ary
./test/runner.rb:33:in `require': cannot load such file -- simplecov (LoadError)
	from ./test/runner.rb:33:in `<main>'
uncommon.mk:605: recipe for target 'yes-test-all' failed
make: *** [yes-test-all] Error 1
exit 2
failed(test/dtrace)
== test/erb # 2018-08-10T22:37:08+09:00 (full)
...(snip 14 lines)...
Thread model: posix
gcc version 4.9.2 (Debian 4.9.2-10+deb8u1) 
/home/hsbt/chkbuild/tmp/build/20180810T132833Z/ruby/test/lib/iseq_loader_checker.rb:60: warning: assigned but unused variable - e
/home/hsbt/chkbuild/tmp/build/20180810T132833Z/ruby/test/lib/iseq_loader_checker.rb:46: warning: assigned but unused variable - i2_ary
./test/runner.rb:33:in `require': cannot load such file -- simplecov (LoadError)
	from ./test/runner.rb:33:in `<main>'
uncommon.mk:605: recipe for target 'yes-test-all' failed
make: *** [yes-test-all] Error 1
exit 2
failed(test/erb)
== test/etc # 2018-08-10T22:37:09+09:00 (full)
...(snip 14 lines)...
Thread model: posix
gcc version 4.9.2 (Debian 4.9.2-10+deb8u1) 
/home/hsbt/chkbuild/tmp/build/20180810T132833Z/ruby/test/lib/iseq_loader_checker.rb:60: warning: assigned but unused variable - e
/home/hsbt/chkbuild/tmp/build/20180810T132833Z/ruby/test/lib/iseq_loader_checker.rb:46: warning: assigned but unused variable - i2_ary
./test/runner.rb:33:in `require': cannot load such file -- simplecov (LoadError)
	from ./test/runner.rb:33:in `<main>'
uncommon.mk:605: recipe for target 'yes-test-all' failed
make: *** [yes-test-all] Error 1
exit 2
failed(test/etc)
== test/excludes # 2018-08-10T22:37:10+09:00 (full)
...(snip 14 lines)...
Thread model: posix
gcc version 4.9.2 (Debian 4.9.2-10+deb8u1) 
/home/hsbt/chkbuild/tmp/build/20180810T132833Z/ruby/test/lib/iseq_loader_checker.rb:60: warning: assigned but unused variable - e
/home/hsbt/chkbuild/tmp/build/20180810T132833Z/ruby/test/lib/iseq_loader_checker.rb:46: warning: assigned but unused variable - i2_ary
./test/runner.rb:33:in `require': cannot load such file -- simplecov (LoadError)
	from ./test/runner.rb:33:in `<main>'
uncommon.mk:605: recipe for target 'yes-test-all' failed
make: *** [yes-test-all] Error 1
exit 2
failed(test/excludes)
== test/fiddle # 2018-08-10T22:37:11+09:00 (full)
...(snip 14 lines)...
Thread model: posix
gcc version 4.9.2 (Debian 4.9.2-10+deb8u1) 
/home/hsbt/chkbuild/tmp/build/20180810T132833Z/ruby/test/lib/iseq_loader_checker.rb:60: warning: assigned but unused variable - e
/home/hsbt/chkbuild/tmp/build/20180810T132833Z/ruby/test/lib/iseq_loader_checker.rb:46: warning: assigned but unused variable - i2_ary
./test/runner.rb:33:in `require': cannot load such file -- simplecov (LoadError)
	from ./test/runner.rb:33:in `<main>'
uncommon.mk:605: recipe for target 'yes-test-all' failed
make: *** [yes-test-all] Error 1
exit 2
failed(test/fiddle)
== test/fileutils # 2018-08-10T22:37:11+09:00 (full)
...(snip 14 lines)...
Thread model: posix
gcc version 4.9.2 (Debian 4.9.2-10+deb8u1) 
/home/hsbt/chkbuild/tmp/build/20180810T132833Z/ruby/test/lib/iseq_loader_checker.rb:60: warning: assigned but unused variable - e
/home/hsbt/chkbuild/tmp/build/20180810T132833Z/ruby/test/lib/iseq_loader_checker.rb:46: warning: assigned but unused variable - i2_ary
./test/runner.rb:33:in `require': cannot load such file -- simplecov (LoadError)
	from ./test/runner.rb:33:in `<main>'
uncommon.mk:605: recipe for target 'yes-test-all' failed
make: *** [yes-test-all] Error 1
exit 2
failed(test/fileutils)
== test/gdbm # 2018-08-10T22:37:12+09:00 (full)
...(snip 14 lines)...
Thread model: posix
gcc version 4.9.2 (Debian 4.9.2-10+deb8u1) 
/home/hsbt/chkbuild/tmp/build/20180810T132833Z/ruby/test/lib/iseq_loader_checker.rb:60: warning: assigned but unused variable - e
/home/hsbt/chkbuild/tmp/build/20180810T132833Z/ruby/test/lib/iseq_loader_checker.rb:46: warning: assigned but unused variable - i2_ary
./test/runner.rb:33:in `require': cannot load such file -- simplecov (LoadError)
	from ./test/runner.rb:33:in `<main>'
uncommon.mk:605: recipe for target 'yes-test-all' failed
make: *** [yes-test-all] Error 1
exit 2
failed(test/gdbm)
== test/io # 2018-08-10T22:37:13+09:00 (full)
...(snip 14 lines)...
Thread model: posix
gcc version 4.9.2 (Debian 4.9.2-10+deb8u1) 
/home/hsbt/chkbuild/tmp/build/20180810T132833Z/ruby/test/lib/iseq_loader_checker.rb:60: warning: assigned but unused variable - e
/home/hsbt/chkbuild/tmp/build/20180810T132833Z/ruby/test/lib/iseq_loader_checker.rb:46: warning: assigned but unused variable - i2_ary
./test/runner.rb:33:in `require': cannot load such file -- simplecov (LoadError)
	from ./test/runner.rb:33:in `<main>'
uncommon.mk:605: recipe for target 'yes-test-all' failed
make: *** [yes-test-all] Error 1
exit 2
failed(test/io)
== test/irb # 2018-08-10T22:37:14+09:00 (full)
...(snip 14 lines)...
Thread model: posix
gcc version 4.9.2 (Debian 4.9.2-10+deb8u1) 
/home/hsbt/chkbuild/tmp/build/20180810T132833Z/ruby/test/lib/iseq_loader_checker.rb:60: warning: assigned but unused variable - e
/home/hsbt/chkbuild/tmp/build/20180810T132833Z/ruby/test/lib/iseq_loader_checker.rb:46: warning: assigned but unused variable - i2_ary
./test/runner.rb:33:in `require': cannot load such file -- simplecov (LoadError)
	from ./test/runner.rb:33:in `<main>'
uncommon.mk:605: recipe for target 'yes-test-all' failed
make: *** [yes-test-all] Error 1
exit 2
failed(test/irb)
== test/json # 2018-08-10T22:37:15+09:00 (full)
...(snip 14 lines)...
Thread model: posix
gcc version 4.9.2 (Debian 4.9.2-10+deb8u1) 
/home/hsbt/chkbuild/tmp/build/20180810T132833Z/ruby/test/lib/iseq_loader_checker.rb:60: warning: assigned but unused variable - e
/home/hsbt/chkbuild/tmp/build/20180810T132833Z/ruby/test/lib/iseq_loader_checker.rb:46: warning: assigned but unused variable - i2_ary
./test/runner.rb:33:in `require': cannot load such file -- simplecov (LoadError)
	from ./test/runner.rb:33:in `<main>'
uncommon.mk:605: recipe for target 'yes-test-all' failed
make: *** [yes-test-all] Error 1
exit 2
failed(test/json)
== test/lib # 2018-08-10T22:37:16+09:00 (full)
...(snip 14 lines)...
Thread model: posix
gcc version 4.9.2 (Debian 4.9.2-10+deb8u1) 
/home/hsbt/chkbuild/tmp/build/20180810T132833Z/ruby/test/lib/iseq_loader_checker.rb:60: warning: assigned but unused variable - e
/home/hsbt/chkbuild/tmp/build/20180810T132833Z/ruby/test/lib/iseq_loader_checker.rb:46: warning: assigned but unused variable - i2_ary
./test/runner.rb:33:in `require': cannot load such file -- simplecov (LoadError)
	from ./test/runner.rb:33:in `<main>'
uncommon.mk:605: recipe for target 'yes-test-all' failed
make: *** [yes-test-all] Error 1
exit 2
failed(test/lib)
== test/logger # 2018-08-10T22:37:17+09:00 (full)
...(snip 14 lines)...
Thread model: posix
gcc version 4.9.2 (Debian 4.9.2-10+deb8u1) 
/home/hsbt/chkbuild/tmp/build/20180810T132833Z/ruby/test/lib/iseq_loader_checker.rb:60: warning: assigned but unused variable - e
/home/hsbt/chkbuild/tmp/build/20180810T132833Z/ruby/test/lib/iseq_loader_checker.rb:46: warning: assigned but unused variable - i2_ary
./test/runner.rb:33:in `require': cannot load such file -- simplecov (LoadError)
	from ./test/runner.rb:33:in `<main>'
uncommon.mk:605: recipe for target 'yes-test-all' failed
make: *** [yes-test-all] Error 1
exit 2
failed(test/logger)
== test/matrix # 2018-08-10T22:37:17+09:00 (full)
...(snip 14 lines)...
Thread model: posix
gcc version 4.9.2 (Debian 4.9.2-10+deb8u1) 
/home/hsbt/chkbuild/tmp/build/20180810T132833Z/ruby/test/lib/iseq_loader_checker.rb:60: warning: assigned but unused variable - e
/home/hsbt/chkbuild/tmp/build/20180810T132833Z/ruby/test/lib/iseq_loader_checker.rb:46: warning: assigned but unused variable - i2_ary
./test/runner.rb:33:in `require': cannot load such file -- simplecov (LoadError)
	from ./test/runner.rb:33:in `<main>'
uncommon.mk:605: recipe for target 'yes-test-all' failed
make: *** [yes-test-all] Error 1
exit 2
failed(test/matrix)
== test/minitest # 2018-08-10T22:37:18+09:00 (full)
...(snip 14 lines)...
Thread model: posix
gcc version 4.9.2 (Debian 4.9.2-10+deb8u1) 
/home/hsbt/chkbuild/tmp/build/20180810T132833Z/ruby/test/lib/iseq_loader_checker.rb:60: warning: assigned but unused variable - e
/home/hsbt/chkbuild/tmp/build/20180810T132833Z/ruby/test/lib/iseq_loader_checker.rb:46: warning: assigned but unused variable - i2_ary
./test/runner.rb:33:in `require': cannot load such file -- simplecov (LoadError)
	from ./test/runner.rb:33:in `<main>'
uncommon.mk:605: recipe for target 'yes-test-all' failed
make: *** [yes-test-all] Error 1
exit 2
failed(test/minitest)
== test/misc # 2018-08-10T22:37:19+09:00 (full)
...(snip 14 lines)...
Thread model: posix
gcc version 4.9.2 (Debian 4.9.2-10+deb8u1) 
/home/hsbt/chkbuild/tmp/build/20180810T132833Z/ruby/test/lib/iseq_loader_checker.rb:60: warning: assigned but unused variable - e
/home/hsbt/chkbuild/tmp/build/20180810T132833Z/ruby/test/lib/iseq_loader_checker.rb:46: warning: assigned but unused variable - i2_ary
./test/runner.rb:33:in `require': cannot load such file -- simplecov (LoadError)
	from ./test/runner.rb:33:in `<main>'
uncommon.mk:605: recipe for target 'yes-test-all' failed
make: *** [yes-test-all] Error 1
exit 2
failed(test/misc)
== test/mkmf # 2018-08-10T22:37:20+09:00 (full)
...(snip 14 lines)...
Thread model: posix
gcc version 4.9.2 (Debian 4.9.2-10+deb8u1) 
/home/hsbt/chkbuild/tmp/build/20180810T132833Z/ruby/test/lib/iseq_loader_checker.rb:60: warning: assigned but unused variable - e
/home/hsbt/chkbuild/tmp/build/20180810T132833Z/ruby/test/lib/iseq_loader_checker.rb:46: warning: assigned but unused variable - i2_ary
./test/runner.rb:33:in `require': cannot load such file -- simplecov (LoadError)
	from ./test/runner.rb:33:in `<main>'
uncommon.mk:605: recipe for target 'yes-test-all' failed
make: *** [yes-test-all] Error 1
exit 2
failed(test/mkmf)
== test/monitor # 2018-08-10T22:37:21+09:00 (full)
...(snip 14 lines)...
Thread model: posix
gcc version 4.9.2 (Debian 4.9.2-10+deb8u1) 
/home/hsbt/chkbuild/tmp/build/20180810T132833Z/ruby/test/lib/iseq_loader_checker.rb:60: warning: assigned but unused variable - e
/home/hsbt/chkbuild/tmp/build/20180810T132833Z/ruby/test/lib/iseq_loader_checker.rb:46: warning: assigned but unused variable - i2_ary
./test/runner.rb:33:in `require': cannot load such file -- simplecov (LoadError)
	from ./test/runner.rb:33:in `<main>'
uncommon.mk:605: recipe for target 'yes-test-all' failed
make: *** [yes-test-all] Error 1
exit 2
failed(test/monitor)
== test/net # 2018-08-10T22:37:22+09:00 (full)
...(snip 14 lines)...
Thread model: posix
gcc version 4.9.2 (Debian 4.9.2-10+deb8u1) 
/home/hsbt/chkbuild/tmp/build/20180810T132833Z/ruby/test/lib/iseq_loader_checker.rb:60: warning: assigned but unused variable - e
/home/hsbt/chkbuild/tmp/build/20180810T132833Z/ruby/test/lib/iseq_loader_checker.rb:46: warning: assigned but unused variable - i2_ary
./test/runner.rb:33:in `require': cannot load such file -- simplecov (LoadError)
	from ./test/runner.rb:33:in `<main>'
uncommon.mk:605: recipe for target 'yes-test-all' failed
make: *** [yes-test-all] Error 1
exit 2
failed(test/net)
== test/nkf # 2018-08-10T22:37:23+09:00 (full)
...(snip 14 lines)...
Thread model: posix
gcc version 4.9.2 (Debian 4.9.2-10+deb8u1) 
/home/hsbt/chkbuild/tmp/build/20180810T132833Z/ruby/test/lib/iseq_loader_checker.rb:60: warning: assigned but unused variable - e
/home/hsbt/chkbuild/tmp/build/20180810T132833Z/ruby/test/lib/iseq_loader_checker.rb:46: warning: assigned but unused variable - i2_ary
./test/runner.rb:33:in `require': cannot load such file -- simplecov (LoadError)
	from ./test/runner.rb:33:in `<main>'
uncommon.mk:605: recipe for target 'yes-test-all' failed
make: *** [yes-test-all] Error 1
exit 2
failed(test/nkf)
== test/objspace # 2018-08-10T22:37:23+09:00 (full)
...(snip 14 lines)...
Thread model: posix
gcc version 4.9.2 (Debian 4.9.2-10+deb8u1) 
/home/hsbt/chkbuild/tmp/build/20180810T132833Z/ruby/test/lib/iseq_loader_checker.rb:60: warning: assigned but unused variable - e
/home/hsbt/chkbuild/tmp/build/20180810T132833Z/ruby/test/lib/iseq_loader_checker.rb:46: warning: assigned but unused variable - i2_ary
./test/runner.rb:33:in `require': cannot load such file -- simplecov (LoadError)
	from ./test/runner.rb:33:in `<main>'
uncommon.mk:605: recipe for target 'yes-test-all' failed
make: *** [yes-test-all] Error 1
exit 2
failed(test/objspace)
== test/open-uri # 2018-08-10T22:37:24+09:00 (full)
...(snip 14 lines)...
Thread model: posix
gcc version 4.9.2 (Debian 4.9.2-10+deb8u1) 
/home/hsbt/chkbuild/tmp/build/20180810T132833Z/ruby/test/lib/iseq_loader_checker.rb:60: warning: assigned but unused variable - e
/home/hsbt/chkbuild/tmp/build/20180810T132833Z/ruby/test/lib/iseq_loader_checker.rb:46: warning: assigned but unused variable - i2_ary
./test/runner.rb:33:in `require': cannot load such file -- simplecov (LoadError)
	from ./test/runner.rb:33:in `<main>'
uncommon.mk:605: recipe for target 'yes-test-all' failed
make: *** [yes-test-all] Error 1
exit 2
failed(test/open-uri)
== test/openssl # 2018-08-10T22:37:25+09:00 (full)
...(snip 14 lines)...
Thread model: posix
gcc version 4.9.2 (Debian 4.9.2-10+deb8u1) 
/home/hsbt/chkbuild/tmp/build/20180810T132833Z/ruby/test/lib/iseq_loader_checker.rb:60: warning: assigned but unused variable - e
/home/hsbt/chkbuild/tmp/build/20180810T132833Z/ruby/test/lib/iseq_loader_checker.rb:46: warning: assigned but unused variable - i2_ary
./test/runner.rb:33:in `require': cannot load such file -- simplecov (LoadError)
	from ./test/runner.rb:33:in `<main>'
uncommon.mk:605: recipe for target 'yes-test-all' failed
make: *** [yes-test-all] Error 1
exit 2
failed(test/openssl)
== test/optparse # 2018-08-10T22:37:26+09:00 (full)
...(snip 14 lines)...
Thread model: posix
gcc version 4.9.2 (Debian 4.9.2-10+deb8u1) 
/home/hsbt/chkbuild/tmp/build/20180810T132833Z/ruby/test/lib/iseq_loader_checker.rb:60: warning: assigned but unused variable - e
/home/hsbt/chkbuild/tmp/build/20180810T132833Z/ruby/test/lib/iseq_loader_checker.rb:46: warning: assigned but unused variable - i2_ary
./test/runner.rb:33:in `require': cannot load such file -- simplecov (LoadError)
	from ./test/runner.rb:33:in `<main>'
uncommon.mk:605: recipe for target 'yes-test-all' failed
make: *** [yes-test-all] Error 1
exit 2
failed(test/optparse)
== test/ostruct # 2018-08-10T22:37:27+09:00 (full)
...(snip 14 lines)...
Thread model: posix
gcc version 4.9.2 (Debian 4.9.2-10+deb8u1) 
/home/hsbt/chkbuild/tmp/build/20180810T132833Z/ruby/test/lib/iseq_loader_checker.rb:60: warning: assigned but unused variable - e
/home/hsbt/chkbuild/tmp/build/20180810T132833Z/ruby/test/lib/iseq_loader_checker.rb:46: warning: assigned but unused variable - i2_ary
./test/runner.rb:33:in `require': cannot load such file -- simplecov (LoadError)
	from ./test/runner.rb:33:in `<main>'
uncommon.mk:605: recipe for target 'yes-test-all' failed
make: *** [yes-test-all] Error 1
exit 2
failed(test/ostruct)
== test/pathname # 2018-08-10T22:37:28+09:00 (full)
...(snip 14 lines)...
Thread model: posix
gcc version 4.9.2 (Debian 4.9.2-10+deb8u1) 
/home/hsbt/chkbuild/tmp/build/20180810T132833Z/ruby/test/lib/iseq_loader_checker.rb:60: warning: assigned but unused variable - e
/home/hsbt/chkbuild/tmp/build/20180810T132833Z/ruby/test/lib/iseq_loader_checker.rb:46: warning: assigned but unused variable - i2_ary
./test/runner.rb:33:in `require': cannot load such file -- simplecov (LoadError)
	from ./test/runner.rb:33:in `<main>'
uncommon.mk:605: recipe for target 'yes-test-all' failed
make: *** [yes-test-all] Error 1
exit 2
failed(test/pathname)
== test/psych # 2018-08-10T22:37:29+09:00 (full)
...(snip 14 lines)...
Thread model: posix
gcc version 4.9.2 (Debian 4.9.2-10+deb8u1) 
/home/hsbt/chkbuild/tmp/build/20180810T132833Z/ruby/test/lib/iseq_loader_checker.rb:60: warning: assigned but unused variable - e
/home/hsbt/chkbuild/tmp/build/20180810T132833Z/ruby/test/lib/iseq_loader_checker.rb:46: warning: assigned but unused variable - i2_ary
./test/runner.rb:33:in `require': cannot load such file -- simplecov (LoadError)
	from ./test/runner.rb:33:in `<main>'
uncommon.mk:605: recipe for target 'yes-test-all' failed
make: *** [yes-test-all] Error 1
exit 2
failed(test/psych)
== test/rdoc # 2018-08-10T22:37:29+09:00 (full)
...(snip 14 lines)...
Thread model: posix
gcc version 4.9.2 (Debian 4.9.2-10+deb8u1) 
/home/hsbt/chkbuild/tmp/build/20180810T132833Z/ruby/test/lib/iseq_loader_checker.rb:60: warning: assigned but unused variable - e
/home/hsbt/chkbuild/tmp/build/20180810T132833Z/ruby/test/lib/iseq_loader_checker.rb:46: warning: assigned but unused variable - i2_ary
./test/runner.rb:33:in `require': cannot load such file -- simplecov (LoadError)
	from ./test/runner.rb:33:in `<main>'
uncommon.mk:605: recipe for target 'yes-test-all' failed
make: *** [yes-test-all] Error 1
exit 2
failed(test/rdoc)
== test/readline # 2018-08-10T22:37:30+09:00 (full)
...(snip 14 lines)...
Thread model: posix
gcc version 4.9.2 (Debian 4.9.2-10+deb8u1) 
/home/hsbt/chkbuild/tmp/build/20180810T132833Z/ruby/test/lib/iseq_loader_checker.rb:60: warning: assigned but unused variable - e
/home/hsbt/chkbuild/tmp/build/20180810T132833Z/ruby/test/lib/iseq_loader_checker.rb:46: warning: assigned but unused variable - i2_ary
./test/runner.rb:33:in `require': cannot load such file -- simplecov (LoadError)
	from ./test/runner.rb:33:in `<main>'
uncommon.mk:605: recipe for target 'yes-test-all' failed
make: *** [yes-test-all] Error 1
exit 2
failed(test/readline)
== test/resolv # 2018-08-10T22:37:31+09:00 (full)
...(snip 14 lines)...
Thread model: posix
gcc version 4.9.2 (Debian 4.9.2-10+deb8u1) 
/home/hsbt/chkbuild/tmp/build/20180810T132833Z/ruby/test/lib/iseq_loader_checker.rb:60: warning: assigned but unused variable - e
/home/hsbt/chkbuild/tmp/build/20180810T132833Z/ruby/test/lib/iseq_loader_checker.rb:46: warning: assigned but unused variable - i2_ary
./test/runner.rb:33:in `require': cannot load such file -- simplecov (LoadError)
	from ./test/runner.rb:33:in `<main>'
uncommon.mk:605: recipe for target 'yes-test-all' failed
make: *** [yes-test-all] Error 1
exit 2
failed(test/resolv)
== test/rexml # 2018-08-10T22:37:32+09:00 (full)
...(snip 14 lines)...
Thread model: posix
gcc version 4.9.2 (Debian 4.9.2-10+deb8u1) 
/home/hsbt/chkbuild/tmp/build/20180810T132833Z/ruby/test/lib/iseq_loader_checker.rb:60: warning: assigned but unused variable - e
/home/hsbt/chkbuild/tmp/build/20180810T132833Z/ruby/test/lib/iseq_loader_checker.rb:46: warning: assigned but unused variable - i2_ary
./test/runner.rb:33:in `require': cannot load such file -- simplecov (LoadError)
	from ./test/runner.rb:33:in `<main>'
uncommon.mk:605: recipe for target 'yes-test-all' failed
make: *** [yes-test-all] Error 1
exit 2
failed(test/rexml)
== test/rinda # 2018-08-10T22:37:33+09:00 (full)
...(snip 14 lines)...
Thread model: posix
gcc version 4.9.2 (Debian 4.9.2-10+deb8u1) 
/home/hsbt/chkbuild/tmp/build/20180810T132833Z/ruby/test/lib/iseq_loader_checker.rb:60: warning: assigned but unused variable - e
/home/hsbt/chkbuild/tmp/build/20180810T132833Z/ruby/test/lib/iseq_loader_checker.rb:46: warning: assigned but unused variable - i2_ary
./test/runner.rb:33:in `require': cannot load such file -- simplecov (LoadError)
	from ./test/runner.rb:33:in `<main>'
uncommon.mk:605: recipe for target 'yes-test-all' failed
make: *** [yes-test-all] Error 1
exit 2
failed(test/rinda)
== test/ripper # 2018-08-10T22:37:34+09:00 (full)
...(snip 14 lines)...
Thread model: posix
gcc version 4.9.2 (Debian 4.9.2-10+deb8u1) 
/home/hsbt/chkbuild/tmp/build/20180810T132833Z/ruby/test/lib/iseq_loader_checker.rb:60: warning: assigned but unused variable - e
/home/hsbt/chkbuild/tmp/build/20180810T132833Z/ruby/test/lib/iseq_loader_checker.rb:46: warning: assigned but unused variable - i2_ary
./test/runner.rb:33:in `require': cannot load such file -- simplecov (LoadError)
	from ./test/runner.rb:33:in `<main>'
uncommon.mk:605: recipe for target 'yes-test-all' failed
make: *** [yes-test-all] Error 1
exit 2
failed(test/ripper)
== test/rss # 2018-08-10T22:37:35+09:00 (full)
...(snip 14 lines)...
Thread model: posix
gcc version 4.9.2 (Debian 4.9.2-10+deb8u1) 
/home/hsbt/chkbuild/tmp/build/20180810T132833Z/ruby/test/lib/iseq_loader_checker.rb:60: warning: assigned but unused variable - e
/home/hsbt/chkbuild/tmp/build/20180810T132833Z/ruby/test/lib/iseq_loader_checker.rb:46: warning: assigned but unused variable - i2_ary
./test/runner.rb:33:in `require': cannot load such file -- simplecov (LoadError)
	from ./test/runner.rb:33:in `<main>'
uncommon.mk:605: recipe for target 'yes-test-all' failed
make: *** [yes-test-all] Error 1
exit 2
failed(test/rss)
== test/ruby # 2018-08-10T22:37:35+09:00 (full)
...(snip 14 lines)...
Thread model: posix
gcc version 4.9.2 (Debian 4.9.2-10+deb8u1) 
/home/hsbt/chkbuild/tmp/build/20180810T132833Z/ruby/test/lib/iseq_loader_checker.rb:60: warning: assigned but unused variable - e
/home/hsbt/chkbuild/tmp/build/20180810T132833Z/ruby/test/lib/iseq_loader_checker.rb:46: warning: assigned but unused variable - i2_ary
./test/runner.rb:33:in `require': cannot load such file -- simplecov (LoadError)
	from ./test/runner.rb:33:in `<main>'
uncommon.mk:605: recipe for target 'yes-test-all' failed
make: *** [yes-test-all] Error 1
exit 2
failed(test/ruby)
== test/rubygems # 2018-08-10T22:37:36+09:00 (full)
...(snip 14 lines)...
Thread model: posix
gcc version 4.9.2 (Debian 4.9.2-10+deb8u1) 
/home/hsbt/chkbuild/tmp/build/20180810T132833Z/ruby/test/lib/iseq_loader_checker.rb:60: warning: assigned but unused variable - e
/home/hsbt/chkbuild/tmp/build/20180810T132833Z/ruby/test/lib/iseq_loader_checker.rb:46: warning: assigned but unused variable - i2_ary
./test/runner.rb:33:in `require': cannot load such file -- simplecov (LoadError)
	from ./test/runner.rb:33:in `<main>'
uncommon.mk:605: recipe for target 'yes-test-all' failed
make: *** [yes-test-all] Error 1
exit 2
failed(test/rubygems)
== test/scanf # 2018-08-10T22:37:37+09:00 (full)
...(snip 14 lines)...
Thread model: posix
gcc version 4.9.2 (Debian 4.9.2-10+deb8u1) 
/home/hsbt/chkbuild/tmp/build/20180810T132833Z/ruby/test/lib/iseq_loader_checker.rb:60: warning: assigned but unused variable - e
/home/hsbt/chkbuild/tmp/build/20180810T132833Z/ruby/test/lib/iseq_loader_checker.rb:46: warning: assigned but unused variable - i2_ary
./test/runner.rb:33:in `require': cannot load such file -- simplecov (LoadError)
	from ./test/runner.rb:33:in `<main>'
uncommon.mk:605: recipe for target 'yes-test-all' failed
make: *** [yes-test-all] Error 1
exit 2
failed(test/scanf)
== test/sdbm # 2018-08-10T22:37:38+09:00 (full)
...(snip 14 lines)...
Thread model: posix
gcc version 4.9.2 (Debian 4.9.2-10+deb8u1) 
/home/hsbt/chkbuild/tmp/build/20180810T132833Z/ruby/test/lib/iseq_loader_checker.rb:60: warning: assigned but unused variable - e
/home/hsbt/chkbuild/tmp/build/20180810T132833Z/ruby/test/lib/iseq_loader_checker.rb:46: warning: assigned but unused variable - i2_ary
./test/runner.rb:33:in `require': cannot load such file -- simplecov (LoadError)
	from ./test/runner.rb:33:in `<main>'
uncommon.mk:605: recipe for target 'yes-test-all' failed
make: *** [yes-test-all] Error 1
exit 2
failed(test/sdbm)
== test/shell # 2018-08-10T22:37:39+09:00 (full)
...(snip 14 lines)...
Thread model: posix
gcc version 4.9.2 (Debian 4.9.2-10+deb8u1) 
/home/hsbt/chkbuild/tmp/build/20180810T132833Z/ruby/test/lib/iseq_loader_checker.rb:60: warning: assigned but unused variable - e
/home/hsbt/chkbuild/tmp/build/20180810T132833Z/ruby/test/lib/iseq_loader_checker.rb:46: warning: assigned but unused variable - i2_ary
./test/runner.rb:33:in `require': cannot load such file -- simplecov (LoadError)
	from ./test/runner.rb:33:in `<main>'
uncommon.mk:605: recipe for target 'yes-test-all' failed
make: *** [yes-test-all] Error 1
exit 2
failed(test/shell)
== test/socket # 2018-08-10T22:37:40+09:00 (full)
...(snip 14 lines)...
Thread model: posix
gcc version 4.9.2 (Debian 4.9.2-10+deb8u1) 
/home/hsbt/chkbuild/tmp/build/20180810T132833Z/ruby/test/lib/iseq_loader_checker.rb:60: warning: assigned but unused variable - e
/home/hsbt/chkbuild/tmp/build/20180810T132833Z/ruby/test/lib/iseq_loader_checker.rb:46: warning: assigned but unused variable - i2_ary
./test/runner.rb:33:in `require': cannot load such file -- simplecov (LoadError)
	from ./test/runner.rb:33:in `<main>'
uncommon.mk:605: recipe for target 'yes-test-all' failed
make: *** [yes-test-all] Error 1
exit 2
failed(test/socket)
== test/stringio # 2018-08-10T22:37:41+09:00 (full)
...(snip 14 lines)...
Thread model: posix
gcc version 4.9.2 (Debian 4.9.2-10+deb8u1) 
/home/hsbt/chkbuild/tmp/build/20180810T132833Z/ruby/test/lib/iseq_loader_checker.rb:60: warning: assigned but unused variable - e
/home/hsbt/chkbuild/tmp/build/20180810T132833Z/ruby/test/lib/iseq_loader_checker.rb:46: warning: assigned but unused variable - i2_ary
./test/runner.rb:33:in `require': cannot load such file -- simplecov (LoadError)
	from ./test/runner.rb:33:in `<main>'
uncommon.mk:605: recipe for target 'yes-test-all' failed
make: *** [yes-test-all] Error 1
exit 2
failed(test/stringio)
== test/strscan # 2018-08-10T22:37:41+09:00 (full)
...(snip 14 lines)...
Thread model: posix
gcc version 4.9.2 (Debian 4.9.2-10+deb8u1) 
/home/hsbt/chkbuild/tmp/build/20180810T132833Z/ruby/test/lib/iseq_loader_checker.rb:60: warning: assigned but unused variable - e
/home/hsbt/chkbuild/tmp/build/20180810T132833Z/ruby/test/lib/iseq_loader_checker.rb:46: warning: assigned but unused variable - i2_ary
./test/runner.rb:33:in `require': cannot load such file -- simplecov (LoadError)
	from ./test/runner.rb:33:in `<main>'
uncommon.mk:605: recipe for target 'yes-test-all' failed
make: *** [yes-test-all] Error 1
exit 2
failed(test/strscan)
== test/syslog # 2018-08-10T22:37:42+09:00 (full)
...(snip 14 lines)...
Thread model: posix
gcc version 4.9.2 (Debian 4.9.2-10+deb8u1) 
/home/hsbt/chkbuild/tmp/build/20180810T132833Z/ruby/test/lib/iseq_loader_checker.rb:60: warning: assigned but unused variable - e
/home/hsbt/chkbuild/tmp/build/20180810T132833Z/ruby/test/lib/iseq_loader_checker.rb:46: warning: assigned but unused variable - i2_ary
./test/runner.rb:33:in `require': cannot load such file -- simplecov (LoadError)
	from ./test/runner.rb:33:in `<main>'
uncommon.mk:605: recipe for target 'yes-test-all' failed
make: *** [yes-test-all] Error 1
exit 2
failed(test/syslog)
== test/test_abbrev.rb # 2018-08-10T22:37:43+09:00 (full)
...(snip 14 lines)...
Thread model: posix
gcc version 4.9.2 (Debian 4.9.2-10+deb8u1) 
/home/hsbt/chkbuild/tmp/build/20180810T132833Z/ruby/test/lib/iseq_loader_checker.rb:60: warning: assigned but unused variable - e
/home/hsbt/chkbuild/tmp/build/20180810T132833Z/ruby/test/lib/iseq_loader_checker.rb:46: warning: assigned but unused variable - i2_ary
./test/runner.rb:33:in `require': cannot load such file -- simplecov (LoadError)
	from ./test/runner.rb:33:in `<main>'
uncommon.mk:605: recipe for target 'yes-test-all' failed
make: *** [yes-test-all] Error 1
exit 2
failed(test/test_abbrev.rb)
== test/test_cmath.rb # 2018-08-10T22:37:44+09:00 (full)
...(snip 14 lines)...
Thread model: posix
gcc version 4.9.2 (Debian 4.9.2-10+deb8u1) 
/home/hsbt/chkbuild/tmp/build/20180810T132833Z/ruby/test/lib/iseq_loader_checker.rb:60: warning: assigned but unused variable - e
/home/hsbt/chkbuild/tmp/build/20180810T132833Z/ruby/test/lib/iseq_loader_checker.rb:46: warning: assigned but unused variable - i2_ary
./test/runner.rb:33:in `require': cannot load such file -- simplecov (LoadError)
	from ./test/runner.rb:33:in `<main>'
uncommon.mk:605: recipe for target 'yes-test-all' failed
make: *** [yes-test-all] Error 1
exit 2
failed(test/test_cmath.rb)
== test/test_delegate.rb # 2018-08-10T22:37:45+09:00 (full)
...(snip 14 lines)...
Thread model: posix
gcc version 4.9.2 (Debian 4.9.2-10+deb8u1) 
/home/hsbt/chkbuild/tmp/build/20180810T132833Z/ruby/test/lib/iseq_loader_checker.rb:60: warning: assigned but unused variable - e
/home/hsbt/chkbuild/tmp/build/20180810T132833Z/ruby/test/lib/iseq_loader_checker.rb:46: warning: assigned but unused variable - i2_ary
./test/runner.rb:33:in `require': cannot load such file -- simplecov (LoadError)
	from ./test/runner.rb:33:in `<main>'
uncommon.mk:605: recipe for target 'yes-test-all' failed
make: *** [yes-test-all] Error 1
exit 2
failed(test/test_delegate.rb)
== test/test_find.rb # 2018-08-10T22:37:46+09:00 (full)
...(snip 14 lines)...
Thread model: posix
gcc version 4.9.2 (Debian 4.9.2-10+deb8u1) 
/home/hsbt/chkbuild/tmp/build/20180810T132833Z/ruby/test/lib/iseq_loader_checker.rb:60: warning: assigned but unused variable - e
/home/hsbt/chkbuild/tmp/build/20180810T132833Z/ruby/test/lib/iseq_loader_checker.rb:46: warning: assigned but unused variable - i2_ary
./test/runner.rb:33:in `require': cannot load such file -- simplecov (LoadError)
	from ./test/runner.rb:33:in `<main>'
uncommon.mk:605: recipe for target 'yes-test-all' failed
make: *** [yes-test-all] Error 1
exit 2
failed(test/test_find.rb)
== test/test_forwardable.rb # 2018-08-10T22:37:46+09:00 (full)
...(snip 14 lines)...
Thread model: posix
gcc version 4.9.2 (Debian 4.9.2-10+deb8u1) 
/home/hsbt/chkbuild/tmp/build/20180810T132833Z/ruby/test/lib/iseq_loader_checker.rb:60: warning: assigned but unused variable - e
/home/hsbt/chkbuild/tmp/build/20180810T132833Z/ruby/test/lib/iseq_loader_checker.rb:46: warning: assigned but unused variable - i2_ary
./test/runner.rb:33:in `require': cannot load such file -- simplecov (LoadError)
	from ./test/runner.rb:33:in `<main>'
uncommon.mk:605: recipe for target 'yes-test-all' failed
make: *** [yes-test-all] Error 1
exit 2
failed(test/test_forwardable.rb)
== test/test_ipaddr.rb # 2018-08-10T22:37:47+09:00 (full)
...(snip 14 lines)...
Thread model: posix
gcc version 4.9.2 (Debian 4.9.2-10+deb8u1) 
/home/hsbt/chkbuild/tmp/build/20180810T132833Z/ruby/test/lib/iseq_loader_checker.rb:60: warning: assigned but unused variable - e
/home/hsbt/chkbuild/tmp/build/20180810T132833Z/ruby/test/lib/iseq_loader_checker.rb:46: warning: assigned but unused variable - i2_ary
./test/runner.rb:33:in `require': cannot load such file -- simplecov (LoadError)
	from ./test/runner.rb:33:in `<main>'
uncommon.mk:605: recipe for target 'yes-test-all' failed
make: *** [yes-test-all] Error 1
exit 2
failed(test/test_ipaddr.rb)
== test/test_mathn.rb # 2018-08-10T22:37:48+09:00 (full)
...(snip 14 lines)...
Thread model: posix
gcc version 4.9.2 (Debian 4.9.2-10+deb8u1) 
/home/hsbt/chkbuild/tmp/build/20180810T132833Z/ruby/test/lib/iseq_loader_checker.rb:60: warning: assigned but unused variable - e
/home/hsbt/chkbuild/tmp/build/20180810T132833Z/ruby/test/lib/iseq_loader_checker.rb:46: warning: assigned but unused variable - i2_ary
./test/runner.rb:33:in `require': cannot load such file -- simplecov (LoadError)
	from ./test/runner.rb:33:in `<main>'
uncommon.mk:605: recipe for target 'yes-test-all' failed
make: *** [yes-test-all] Error 1
exit 2
failed(test/test_mathn.rb)
== test/test_mutex_m.rb # 2018-08-10T22:37:49+09:00 (full)
...(snip 14 lines)...
Thread model: posix
gcc version 4.9.2 (Debian 4.9.2-10+deb8u1) 
/home/hsbt/chkbuild/tmp/build/20180810T132833Z/ruby/test/lib/iseq_loader_checker.rb:60: warning: assigned but unused variable - e
/home/hsbt/chkbuild/tmp/build/20180810T132833Z/ruby/test/lib/iseq_loader_checker.rb:46: warning: assigned but unused variable - i2_ary
./test/runner.rb:33:in `require': cannot load such file -- simplecov (LoadError)
	from ./test/runner.rb:33:in `<main>'
uncommon.mk:605: recipe for target 'yes-test-all' failed
make: *** [yes-test-all] Error 1
exit 2
failed(test/test_mutex_m.rb)
== test/test_observer.rb # 2018-08-10T22:37:50+09:00 (full)
...(snip 14 lines)...
Thread model: posix
gcc version 4.9.2 (Debian 4.9.2-10+deb8u1) 
/home/hsbt/chkbuild/tmp/build/20180810T132833Z/ruby/test/lib/iseq_loader_checker.rb:60: warning: assigned but unused variable - e
/home/hsbt/chkbuild/tmp/build/20180810T132833Z/ruby/test/lib/iseq_loader_checker.rb:46: warning: assigned but unused variable - i2_ary
./test/runner.rb:33:in `require': cannot load such file -- simplecov (LoadError)
	from ./test/runner.rb:33:in `<main>'
uncommon.mk:605: recipe for target 'yes-test-all' failed
make: *** [yes-test-all] Error 1
exit 2
failed(test/test_observer.rb)
== test/test_open3.rb # 2018-08-10T22:37:51+09:00 (full)
...(snip 14 lines)...
Thread model: posix
gcc version 4.9.2 (Debian 4.9.2-10+deb8u1) 
/home/hsbt/chkbuild/tmp/build/20180810T132833Z/ruby/test/lib/iseq_loader_checker.rb:60: warning: assigned but unused variable - e
/home/hsbt/chkbuild/tmp/build/20180810T132833Z/ruby/test/lib/iseq_loader_checker.rb:46: warning: assigned but unused variable - i2_ary
./test/runner.rb:33:in `require': cannot load such file -- simplecov (LoadError)
	from ./test/runner.rb:33:in `<main>'
uncommon.mk:605: recipe for target 'yes-test-all' failed
make: *** [yes-test-all] Error 1
exit 2
failed(test/test_open3.rb)
== test/test_pp.rb # 2018-08-10T22:37:52+09:00 (full)
...(snip 14 lines)...
Thread model: posix
gcc version 4.9.2 (Debian 4.9.2-10+deb8u1) 
/home/hsbt/chkbuild/tmp/build/20180810T132833Z/ruby/test/lib/iseq_loader_checker.rb:60: warning: assigned but unused variable - e
/home/hsbt/chkbuild/tmp/build/20180810T132833Z/ruby/test/lib/iseq_loader_checker.rb:46: warning: assigned but unused variable - i2_ary
./test/runner.rb:33:in `require': cannot load such file -- simplecov (LoadError)
	from ./test/runner.rb:33:in `<main>'
uncommon.mk:605: recipe for target 'yes-test-all' failed
make: *** [yes-test-all] Error 1
exit 2
failed(test/test_pp.rb)
== test/test_prettyprint.rb # 2018-08-10T22:37:52+09:00 (full)
...(snip 14 lines)...
Thread model: posix
gcc version 4.9.2 (Debian 4.9.2-10+deb8u1) 
/home/hsbt/chkbuild/tmp/build/20180810T132833Z/ruby/test/lib/iseq_loader_checker.rb:60: warning: assigned but unused variable - e
/home/hsbt/chkbuild/tmp/build/20180810T132833Z/ruby/test/lib/iseq_loader_checker.rb:46: warning: assigned but unused variable - i2_ary
./test/runner.rb:33:in `require': cannot load such file -- simplecov (LoadError)
	from ./test/runner.rb:33:in `<main>'
uncommon.mk:605: recipe for target 'yes-test-all' failed
make: *** [yes-test-all] Error 1
exit 2
failed(test/test_prettyprint.rb)
== test/test_prime.rb # 2018-08-10T22:37:53+09:00 (full)
...(snip 14 lines)...
Thread model: posix
gcc version 4.9.2 (Debian 4.9.2-10+deb8u1) 
/home/hsbt/chkbuild/tmp/build/20180810T132833Z/ruby/test/lib/iseq_loader_checker.rb:60: warning: assigned but unused variable - e
/home/hsbt/chkbuild/tmp/build/20180810T132833Z/ruby/test/lib/iseq_loader_checker.rb:46: warning: assigned but unused variable - i2_ary
./test/runner.rb:33:in `require': cannot load such file -- simplecov (LoadError)
	from ./test/runner.rb:33:in `<main>'
uncommon.mk:605: recipe for target 'yes-test-all' failed
make: *** [yes-test-all] Error 1
exit 2
failed(test/test_prime.rb)
== test/test_pstore.rb # 2018-08-10T22:37:54+09:00 (full)
...(snip 14 lines)...
Thread model: posix
gcc version 4.9.2 (Debian 4.9.2-10+deb8u1) 
/home/hsbt/chkbuild/tmp/build/20180810T132833Z/ruby/test/lib/iseq_loader_checker.rb:60: warning: assigned but unused variable - e
/home/hsbt/chkbuild/tmp/build/20180810T132833Z/ruby/test/lib/iseq_loader_checker.rb:46: warning: assigned but unused variable - i2_ary
./test/runner.rb:33:in `require': cannot load such file -- simplecov (LoadError)
	from ./test/runner.rb:33:in `<main>'
uncommon.mk:605: recipe for target 'yes-test-all' failed
make: *** [yes-test-all] Error 1
exit 2
failed(test/test_pstore.rb)
== test/test_pty.rb # 2018-08-10T22:37:55+09:00 (full)
...(snip 14 lines)...
Thread model: posix
gcc version 4.9.2 (Debian 4.9.2-10+deb8u1) 
/home/hsbt/chkbuild/tmp/build/20180810T132833Z/ruby/test/lib/iseq_loader_checker.rb:60: warning: assigned but unused variable - e
/home/hsbt/chkbuild/tmp/build/20180810T132833Z/ruby/test/lib/iseq_loader_checker.rb:46: warning: assigned but unused variable - i2_ary
./test/runner.rb:33:in `require': cannot load such file -- simplecov (LoadError)
	from ./test/runner.rb:33:in `<main>'
uncommon.mk:605: recipe for target 'yes-test-all' failed
make: *** [yes-test-all] Error 1
exit 2
failed(test/test_pty.rb)
== test/test_rbconfig.rb # 2018-08-10T22:37:56+09:00 (full)
...(snip 14 lines)...
Thread model: posix
gcc version 4.9.2 (Debian 4.9.2-10+deb8u1) 
/home/hsbt/chkbuild/tmp/build/20180810T132833Z/ruby/test/lib/iseq_loader_checker.rb:60: warning: assigned but unused variable - e
/home/hsbt/chkbuild/tmp/build/20180810T132833Z/ruby/test/lib/iseq_loader_checker.rb:46: warning: assigned but unused variable - i2_ary
./test/runner.rb:33:in `require': cannot load such file -- simplecov (LoadError)
	from ./test/runner.rb:33:in `<main>'
uncommon.mk:605: recipe for target 'yes-test-all' failed
make: *** [yes-test-all] Error 1
exit 2
failed(test/test_rbconfig.rb)
== test/test_securerandom.rb # 2018-08-10T22:37:57+09:00 (full)
...(snip 14 lines)...
Thread model: posix
gcc version 4.9.2 (Debian 4.9.2-10+deb8u1) 
/home/hsbt/chkbuild/tmp/build/20180810T132833Z/ruby/test/lib/iseq_loader_checker.rb:60: warning: assigned but unused variable - e
/home/hsbt/chkbuild/tmp/build/20180810T132833Z/ruby/test/lib/iseq_loader_checker.rb:46: warning: assigned but unused variable - i2_ary
./test/runner.rb:33:in `require': cannot load such file -- simplecov (LoadError)
	from ./test/runner.rb:33:in `<main>'
uncommon.mk:605: recipe for target 'yes-test-all' failed
make: *** [yes-test-all] Error 1
exit 2
failed(test/test_securerandom.rb)
== test/test_set.rb # 2018-08-10T22:37:58+09:00 (full)
...(snip 14 lines)...
Thread model: posix
gcc version 4.9.2 (Debian 4.9.2-10+deb8u1) 
/home/hsbt/chkbuild/tmp/build/20180810T132833Z/ruby/test/lib/iseq_loader_checker.rb:60: warning: assigned but unused variable - e
/home/hsbt/chkbuild/tmp/build/20180810T132833Z/ruby/test/lib/iseq_loader_checker.rb:46: warning: assigned but unused variable - i2_ary
./test/runner.rb:33:in `require': cannot load such file -- simplecov (LoadError)
	from ./test/runner.rb:33:in `<main>'
uncommon.mk:605: recipe for target 'yes-test-all' failed
make: *** [yes-test-all] Error 1
exit 2
failed(test/test_set.rb)
== test/test_shellwords.rb # 2018-08-10T22:37:58+09:00 (full)
...(snip 14 lines)...
Thread model: posix
gcc version 4.9.2 (Debian 4.9.2-10+deb8u1) 
/home/hsbt/chkbuild/tmp/build/20180810T132833Z/ruby/test/lib/iseq_loader_checker.rb:60: warning: assigned but unused variable - e
/home/hsbt/chkbuild/tmp/build/20180810T132833Z/ruby/test/lib/iseq_loader_checker.rb:46: warning: assigned but unused variable - i2_ary
./test/runner.rb:33:in `require': cannot load such file -- simplecov (LoadError)
	from ./test/runner.rb:33:in `<main>'
uncommon.mk:605: recipe for target 'yes-test-all' failed
make: *** [yes-test-all] Error 1
exit 2
failed(test/test_shellwords.rb)
== test/test_singleton.rb # 2018-08-10T22:37:59+09:00 (full)
...(snip 14 lines)...
Thread model: posix
gcc version 4.9.2 (Debian 4.9.2-10+deb8u1) 
/home/hsbt/chkbuild/tmp/build/20180810T132833Z/ruby/test/lib/iseq_loader_checker.rb:60: warning: assigned but unused variable - e
/home/hsbt/chkbuild/tmp/build/20180810T132833Z/ruby/test/lib/iseq_loader_checker.rb:46: warning: assigned but unused variable - i2_ary
./test/runner.rb:33:in `require': cannot load such file -- simplecov (LoadError)
	from ./test/runner.rb:33:in `<main>'
uncommon.mk:605: recipe for target 'yes-test-all' failed
make: *** [yes-test-all] Error 1
exit 2
failed(test/test_singleton.rb)
== test/test_syslog.rb # 2018-08-10T22:38:00+09:00 (full)
...(snip 14 lines)...
Thread model: posix
gcc version 4.9.2 (Debian 4.9.2-10+deb8u1) 
/home/hsbt/chkbuild/tmp/build/20180810T132833Z/ruby/test/lib/iseq_loader_checker.rb:60: warning: assigned but unused variable - e
/home/hsbt/chkbuild/tmp/build/20180810T132833Z/ruby/test/lib/iseq_loader_checker.rb:46: warning: assigned but unused variable - i2_ary
./test/runner.rb:33:in `require': cannot load such file -- simplecov (LoadError)
	from ./test/runner.rb:33:in `<main>'
uncommon.mk:605: recipe for target 'yes-test-all' failed
make: *** [yes-test-all] Error 1
exit 2
failed(test/test_syslog.rb)
== test/test_tempfile.rb # 2018-08-10T22:38:01+09:00 (full)
...(snip 14 lines)...
Thread model: posix
gcc version 4.9.2 (Debian 4.9.2-10+deb8u1) 
/home/hsbt/chkbuild/tmp/build/20180810T132833Z/ruby/test/lib/iseq_loader_checker.rb:60: warning: assigned but unused variable - e
/home/hsbt/chkbuild/tmp/build/20180810T132833Z/ruby/test/lib/iseq_loader_checker.rb:46: warning: assigned but unused variable - i2_ary
./test/runner.rb:33:in `require': cannot load such file -- simplecov (LoadError)
	from ./test/runner.rb:33:in `<main>'
uncommon.mk:605: recipe for target 'yes-test-all' failed
make: *** [yes-test-all] Error 1
exit 2
failed(test/test_tempfile.rb)
== test/test_time.rb # 2018-08-10T22:38:02+09:00 (full)
...(snip 14 lines)...
Thread model: posix
gcc version 4.9.2 (Debian 4.9.2-10+deb8u1) 
/home/hsbt/chkbuild/tmp/build/20180810T132833Z/ruby/test/lib/iseq_loader_checker.rb:60: warning: assigned but unused variable - e
/home/hsbt/chkbuild/tmp/build/20180810T132833Z/ruby/test/lib/iseq_loader_checker.rb:46: warning: assigned but unused variable - i2_ary
./test/runner.rb:33:in `require': cannot load such file -- simplecov (LoadError)
	from ./test/runner.rb:33:in `<main>'
uncommon.mk:605: recipe for target 'yes-test-all' failed
make: *** [yes-test-all] Error 1
exit 2
failed(test/test_time.rb)
== test/test_timeout.rb # 2018-08-10T22:38:03+09:00 (full)
...(snip 14 lines)...
Thread model: posix
gcc version 4.9.2 (Debian 4.9.2-10+deb8u1) 
/home/hsbt/chkbuild/tmp/build/20180810T132833Z/ruby/test/lib/iseq_loader_checker.rb:60: warning: assigned but unused variable - e
/home/hsbt/chkbuild/tmp/build/20180810T132833Z/ruby/test/lib/iseq_loader_checker.rb:46: warning: assigned but unused variable - i2_ary
./test/runner.rb:33:in `require': cannot load such file -- simplecov (LoadError)
	from ./test/runner.rb:33:in `<main>'
uncommon.mk:605: recipe for target 'yes-test-all' failed
make: *** [yes-test-all] Error 1
exit 2
failed(test/test_timeout.rb)
== test/test_tmpdir.rb # 2018-08-10T22:38:03+09:00 (full)
...(snip 14 lines)...
Thread model: posix
gcc version 4.9.2 (Debian 4.9.2-10+deb8u1) 
/home/hsbt/chkbuild/tmp/build/20180810T132833Z/ruby/test/lib/iseq_loader_checker.rb:60: warning: assigned but unused variable - e
/home/hsbt/chkbuild/tmp/build/20180810T132833Z/ruby/test/lib/iseq_loader_checker.rb:46: warning: assigned but unused variable - i2_ary
./test/runner.rb:33:in `require': cannot load such file -- simplecov (LoadError)
	from ./test/runner.rb:33:in `<main>'
uncommon.mk:605: recipe for target 'yes-test-all' failed
make: *** [yes-test-all] Error 1
exit 2
failed(test/test_tmpdir.rb)
== test/test_tracer.rb # 2018-08-10T22:38:04+09:00 (full)
...(snip 14 lines)...
Thread model: posix
gcc version 4.9.2 (Debian 4.9.2-10+deb8u1) 
/home/hsbt/chkbuild/tmp/build/20180810T132833Z/ruby/test/lib/iseq_loader_checker.rb:60: warning: assigned but unused variable - e
/home/hsbt/chkbuild/tmp/build/20180810T132833Z/ruby/test/lib/iseq_loader_checker.rb:46: warning: assigned but unused variable - i2_ary
./test/runner.rb:33:in `require': cannot load such file -- simplecov (LoadError)
	from ./test/runner.rb:33:in `<main>'
uncommon.mk:605: recipe for target 'yes-test-all' failed
make: *** [yes-test-all] Error 1
exit 2
failed(test/test_tracer.rb)
== test/test_tsort.rb # 2018-08-10T22:38:05+09:00 (full)
...(snip 14 lines)...
Thread model: posix
gcc version 4.9.2 (Debian 4.9.2-10+deb8u1) 
/home/hsbt/chkbuild/tmp/build/20180810T132833Z/ruby/test/lib/iseq_loader_checker.rb:60: warning: assigned but unused variable - e
/home/hsbt/chkbuild/tmp/build/20180810T132833Z/ruby/test/lib/iseq_loader_checker.rb:46: warning: assigned but unused variable - i2_ary
./test/runner.rb:33:in `require': cannot load such file -- simplecov (LoadError)
	from ./test/runner.rb:33:in `<main>'
uncommon.mk:605: recipe for target 'yes-test-all' failed
make: *** [yes-test-all] Error 1
exit 2
failed(test/test_tsort.rb)
== test/test_unicode_normalize.rb # 2018-08-10T22:38:06+09:00 (full)
...(snip 14 lines)...
Thread model: posix
gcc version 4.9.2 (Debian 4.9.2-10+deb8u1) 
/home/hsbt/chkbuild/tmp/build/20180810T132833Z/ruby/test/lib/iseq_loader_checker.rb:60: warning: assigned but unused variable - e
/home/hsbt/chkbuild/tmp/build/20180810T132833Z/ruby/test/lib/iseq_loader_checker.rb:46: warning: assigned but unused variable - i2_ary
./test/runner.rb:33:in `require': cannot load such file -- simplecov (LoadError)
	from ./test/runner.rb:33:in `<main>'
uncommon.mk:605: recipe for target 'yes-test-all' failed
make: *** [yes-test-all] Error 1
exit 2
failed(test/test_unicode_normalize.rb)
== test/test_weakref.rb # 2018-08-10T22:38:07+09:00 (full)
...(snip 14 lines)...
Thread model: posix
gcc version 4.9.2 (Debian 4.9.2-10+deb8u1) 
/home/hsbt/chkbuild/tmp/build/20180810T132833Z/ruby/test/lib/iseq_loader_checker.rb:60: warning: assigned but unused variable - e
/home/hsbt/chkbuild/tmp/build/20180810T132833Z/ruby/test/lib/iseq_loader_checker.rb:46: warning: assigned but unused variable - i2_ary
./test/runner.rb:33:in `require': cannot load such file -- simplecov (LoadError)
	from ./test/runner.rb:33:in `<main>'
uncommon.mk:605: recipe for target 'yes-test-all' failed
make: *** [yes-test-all] Error 1
exit 2
failed(test/test_weakref.rb)
== test/test_win32api.rb # 2018-08-10T22:38:08+09:00 (full)
...(snip 14 lines)...
Thread model: posix
gcc version 4.9.2 (Debian 4.9.2-10+deb8u1) 
/home/hsbt/chkbuild/tmp/build/20180810T132833Z/ruby/test/lib/iseq_loader_checker.rb:60: warning: assigned but unused variable - e
/home/hsbt/chkbuild/tmp/build/20180810T132833Z/ruby/test/lib/iseq_loader_checker.rb:46: warning: assigned but unused variable - i2_ary
./test/runner.rb:33:in `require': cannot load such file -- simplecov (LoadError)
	from ./test/runner.rb:33:in `<main>'
uncommon.mk:605: recipe for target 'yes-test-all' failed
make: *** [yes-test-all] Error 1
exit 2
failed(test/test_win32api.rb)
== test/testunit # 2018-08-10T22:38:09+09:00 (full)
...(snip 14 lines)...
Thread model: posix
gcc version 4.9.2 (Debian 4.9.2-10+deb8u1) 
/home/hsbt/chkbuild/tmp/build/20180810T132833Z/ruby/test/lib/iseq_loader_checker.rb:60: warning: assigned but unused variable - e
/home/hsbt/chkbuild/tmp/build/20180810T132833Z/ruby/test/lib/iseq_loader_checker.rb:46: warning: assigned but unused variable - i2_ary
./test/runner.rb:33:in `require': cannot load such file -- simplecov (LoadError)
	from ./test/runner.rb:33:in `<main>'
uncommon.mk:605: recipe for target 'yes-test-all' failed
make: *** [yes-test-all] Error 1
exit 2
failed(test/testunit)
== test/thread # 2018-08-10T22:38:09+09:00 (full)
...(snip 14 lines)...
Thread model: posix
gcc version 4.9.2 (Debian 4.9.2-10+deb8u1) 
/home/hsbt/chkbuild/tmp/build/20180810T132833Z/ruby/test/lib/iseq_loader_checker.rb:60: warning: assigned but unused variable - e
/home/hsbt/chkbuild/tmp/build/20180810T132833Z/ruby/test/lib/iseq_loader_checker.rb:46: warning: assigned but unused variable - i2_ary
./test/runner.rb:33:in `require': cannot load such file -- simplecov (LoadError)
	from ./test/runner.rb:33:in `<main>'
uncommon.mk:605: recipe for target 'yes-test-all' failed
make: *** [yes-test-all] Error 1
exit 2
failed(test/thread)
== test/uri # 2018-08-10T22:38:10+09:00 (full)
...(snip 14 lines)...
Thread model: posix
gcc version 4.9.2 (Debian 4.9.2-10+deb8u1) 
/home/hsbt/chkbuild/tmp/build/20180810T132833Z/ruby/test/lib/iseq_loader_checker.rb:60: warning: assigned but unused variable - e
/home/hsbt/chkbuild/tmp/build/20180810T132833Z/ruby/test/lib/iseq_loader_checker.rb:46: warning: assigned but unused variable - i2_ary
./test/runner.rb:33:in `require': cannot load such file -- simplecov (LoadError)
	from ./test/runner.rb:33:in `<main>'
uncommon.mk:605: recipe for target 'yes-test-all' failed
make: *** [yes-test-all] Error 1
exit 2
failed(test/uri)
== test/webrick # 2018-08-10T22:38:11+09:00 (full)
...(snip 14 lines)...
Thread model: posix
gcc version 4.9.2 (Debian 4.9.2-10+deb8u1) 
/home/hsbt/chkbuild/tmp/build/20180810T132833Z/ruby/test/lib/iseq_loader_checker.rb:60: warning: assigned but unused variable - e
/home/hsbt/chkbuild/tmp/build/20180810T132833Z/ruby/test/lib/iseq_loader_checker.rb:46: warning: assigned but unused variable - i2_ary
./test/runner.rb:33:in `require': cannot load such file -- simplecov (LoadError)
	from ./test/runner.rb:33:in `<main>'
uncommon.mk:605: recipe for target 'yes-test-all' failed
make: *** [yes-test-all] Error 1
exit 2
failed(test/webrick)
== test/win32ole # 2018-08-10T22:38:12+09:00 (full)
...(snip 14 lines)...
Thread model: posix
gcc version 4.9.2 (Debian 4.9.2-10+deb8u1) 
/home/hsbt/chkbuild/tmp/build/20180810T132833Z/ruby/test/lib/iseq_loader_checker.rb:60: warning: assigned but unused variable - e
/home/hsbt/chkbuild/tmp/build/20180810T132833Z/ruby/test/lib/iseq_loader_checker.rb:46: warning: assigned but unused variable - i2_ary
./test/runner.rb:33:in `require': cannot load such file -- simplecov (LoadError)
	from ./test/runner.rb:33:in `<main>'
uncommon.mk:605: recipe for target 'yes-test-all' failed
make: *** [yes-test-all] Error 1
exit 2
failed(test/win32ole)
== test/xmlrpc # 2018-08-10T22:38:13+09:00 (full)
...(snip 14 lines)...
Thread model: posix
gcc version 4.9.2 (Debian 4.9.2-10+deb8u1) 
/home/hsbt/chkbuild/tmp/build/20180810T132833Z/ruby/test/lib/iseq_loader_checker.rb:60: warning: assigned but unused variable - e
/home/hsbt/chkbuild/tmp/build/20180810T132833Z/ruby/test/lib/iseq_loader_checker.rb:46: warning: assigned but unused variable - i2_ary
./test/runner.rb:33:in `require': cannot load such file -- simplecov (LoadError)
	from ./test/runner.rb:33:in `<main>'
uncommon.mk:605: recipe for target 'yes-test-all' failed
make: *** [yes-test-all] Error 1
exit 2
failed(test/xmlrpc)
== test/zlib # 2018-08-10T22:38:14+09:00 (full)
...(snip 14 lines)...
Thread model: posix
gcc version 4.9.2 (Debian 4.9.2-10+deb8u1) 
/home/hsbt/chkbuild/tmp/build/20180810T132833Z/ruby/test/lib/iseq_loader_checker.rb:60: warning: assigned but unused variable - e
/home/hsbt/chkbuild/tmp/build/20180810T132833Z/ruby/test/lib/iseq_loader_checker.rb:46: warning: assigned but unused variable - i2_ary
./test/runner.rb:33:in `require': cannot load such file -- simplecov (LoadError)
	from ./test/runner.rb:33:in `<main>'
uncommon.mk:605: recipe for target 'yes-test-all' failed
make: *** [yes-test-all] Error 1
exit 2
failed(test/zlib)
== rubyspec # 2018-08-10T22:38:14+09:00 (full)
...(snip 48788 lines)...
- UNIXServer.open by raising an exception when there is a NUL byte
- UNIXSocket.open by raising an exception when there is a NUL byte

/home/hsbt/chkbuild/tmp/build/20180810T132833Z/rubyspec/security/cve_2018_8780_spec.rb                                             
CVE-2018-8780 is resisted by
- Dir.glob by raising an exception when there is a NUL byte
- Dir.entries by raising an exception when there is a NUL byte
- Dir.foreach by raising an exception when there is a NUL byte


1)
Addrinfo.getaddrinfo sets a custom protocol family of the Addrinfo instances ERROR
SocketError: getaddrinfo: Name or service not known
/home/hsbt/chkbuild/tmp/build/20180810T132833Z/rubyspec/library/socket/addrinfo/getaddrinfo_spec.rb:40:in `getaddrinfo'
/home/hsbt/chkbuild/tmp/build/20180810T132833Z/rubyspec/library/socket/addrinfo/getaddrinfo_spec.rb:40:in `block (3 levels) in <top (required)>'
/home/hsbt/chkbuild/tmp/build/20180810T132833Z/rubyspec/library/socket/addrinfo/getaddrinfo_spec.rb:4:in `<top (required)>'

2)
Addrinfo.getaddrinfo sets a corresponding address family based on a custom protocol family ERROR
SocketError: getaddrinfo: Name or service not known
/home/hsbt/chkbuild/tmp/build/20180810T132833Z/rubyspec/library/socket/addrinfo/getaddrinfo_spec.rb:46:in `getaddrinfo'
/home/hsbt/chkbuild/tmp/build/20180810T132833Z/rubyspec/library/socket/addrinfo/getaddrinfo_spec.rb:46:in `block (3 levels) in <top (required)>'
/home/hsbt/chkbuild/tmp/build/20180810T132833Z/rubyspec/library/socket/addrinfo/getaddrinfo_spec.rb:4:in `<top (required)>'

Finished in 80.395500 seconds

3690 files, 29197 examples, 207845 expectations, 0 failures, 2 errors, 0 tagged
exit 1
failed(rubyspec)

20180810T102846Z(failure) < OlderDiff < 20180810T132833Z(failure) > NewerDiff > 20180810T162803Z(failure)


chkbuild summary recent last