r64149 ruby 2.4.5p315 (2018-07-31) [x86_64-linux] [2.4] (debian8) 62W failed(test-all) 90failed(test/) rubyspec:0F2E

chkbuild summary recent last

20180810T101540Z(failure) < OlderDiff < 20180810T131532Z(failure) > NewerDiff > 20180810T161509Z(failure)

== test-all # 2018-08-10T22:23:14+09:00 (full)
...(snip 10 lines)...
Copyright (C) 2014 Free Software Foundation, Inc.
This is free software; see the source for copying conditions.  There is NO
warranty; not even for MERCHANTABILITY or FITNESS FOR A PARTICULAR PURPOSE.

./test/runner.rb:33:in `require': cannot load such file -- simplecov (LoadError)
	from ./test/runner.rb:33:in `<main>'
uncommon.mk:623: recipe for target 'yes-test-all' failed
make: *** [yes-test-all] Error 1
exit 2
failed(test-all)
== test/-ext- # 2018-08-10T22:23:15+09:00 (full)
...(snip 10 lines)...
Copyright (C) 2014 Free Software Foundation, Inc.
This is free software; see the source for copying conditions.  There is NO
warranty; not even for MERCHANTABILITY or FITNESS FOR A PARTICULAR PURPOSE.

./test/runner.rb:33:in `require': cannot load such file -- simplecov (LoadError)
	from ./test/runner.rb:33:in `<main>'
uncommon.mk:623: recipe for target 'yes-test-all' failed
make: *** [yes-test-all] Error 1
exit 2
failed(test/-ext-)
== test/base64 # 2018-08-10T22:23:15+09:00 (full)
...(snip 10 lines)...
Copyright (C) 2014 Free Software Foundation, Inc.
This is free software; see the source for copying conditions.  There is NO
warranty; not even for MERCHANTABILITY or FITNESS FOR A PARTICULAR PURPOSE.

./test/runner.rb:33:in `require': cannot load such file -- simplecov (LoadError)
	from ./test/runner.rb:33:in `<main>'
uncommon.mk:623: recipe for target 'yes-test-all' failed
make: *** [yes-test-all] Error 1
exit 2
failed(test/base64)
== test/benchmark # 2018-08-10T22:23:16+09:00 (full)
...(snip 10 lines)...
Copyright (C) 2014 Free Software Foundation, Inc.
This is free software; see the source for copying conditions.  There is NO
warranty; not even for MERCHANTABILITY or FITNESS FOR A PARTICULAR PURPOSE.

./test/runner.rb:33:in `require': cannot load such file -- simplecov (LoadError)
	from ./test/runner.rb:33:in `<main>'
uncommon.mk:623: recipe for target 'yes-test-all' failed
make: *** [yes-test-all] Error 1
exit 2
failed(test/benchmark)
== test/bigdecimal # 2018-08-10T22:23:17+09:00 (full)
...(snip 10 lines)...
Copyright (C) 2014 Free Software Foundation, Inc.
This is free software; see the source for copying conditions.  There is NO
warranty; not even for MERCHANTABILITY or FITNESS FOR A PARTICULAR PURPOSE.

./test/runner.rb:33:in `require': cannot load such file -- simplecov (LoadError)
	from ./test/runner.rb:33:in `<main>'
uncommon.mk:623: recipe for target 'yes-test-all' failed
make: *** [yes-test-all] Error 1
exit 2
failed(test/bigdecimal)
== test/cgi # 2018-08-10T22:23:18+09:00 (full)
...(snip 10 lines)...
Copyright (C) 2014 Free Software Foundation, Inc.
This is free software; see the source for copying conditions.  There is NO
warranty; not even for MERCHANTABILITY or FITNESS FOR A PARTICULAR PURPOSE.

./test/runner.rb:33:in `require': cannot load such file -- simplecov (LoadError)
	from ./test/runner.rb:33:in `<main>'
uncommon.mk:623: recipe for target 'yes-test-all' failed
make: *** [yes-test-all] Error 1
exit 2
failed(test/cgi)
== test/coverage # 2018-08-10T22:23:19+09:00 (full)
...(snip 10 lines)...
Copyright (C) 2014 Free Software Foundation, Inc.
This is free software; see the source for copying conditions.  There is NO
warranty; not even for MERCHANTABILITY or FITNESS FOR A PARTICULAR PURPOSE.

./test/runner.rb:33:in `require': cannot load such file -- simplecov (LoadError)
	from ./test/runner.rb:33:in `<main>'
uncommon.mk:623: recipe for target 'yes-test-all' failed
make: *** [yes-test-all] Error 1
exit 2
failed(test/coverage)
== test/csv # 2018-08-10T22:23:19+09:00 (full)
...(snip 10 lines)...
Copyright (C) 2014 Free Software Foundation, Inc.
This is free software; see the source for copying conditions.  There is NO
warranty; not even for MERCHANTABILITY or FITNESS FOR A PARTICULAR PURPOSE.

./test/runner.rb:33:in `require': cannot load such file -- simplecov (LoadError)
	from ./test/runner.rb:33:in `<main>'
uncommon.mk:623: recipe for target 'yes-test-all' failed
make: *** [yes-test-all] Error 1
exit 2
failed(test/csv)
== test/date # 2018-08-10T22:23:20+09:00 (full)
...(snip 10 lines)...
Copyright (C) 2014 Free Software Foundation, Inc.
This is free software; see the source for copying conditions.  There is NO
warranty; not even for MERCHANTABILITY or FITNESS FOR A PARTICULAR PURPOSE.

./test/runner.rb:33:in `require': cannot load such file -- simplecov (LoadError)
	from ./test/runner.rb:33:in `<main>'
uncommon.mk:623: recipe for target 'yes-test-all' failed
make: *** [yes-test-all] Error 1
exit 2
failed(test/date)
== test/dbm # 2018-08-10T22:23:21+09:00 (full)
...(snip 10 lines)...
Copyright (C) 2014 Free Software Foundation, Inc.
This is free software; see the source for copying conditions.  There is NO
warranty; not even for MERCHANTABILITY or FITNESS FOR A PARTICULAR PURPOSE.

./test/runner.rb:33:in `require': cannot load such file -- simplecov (LoadError)
	from ./test/runner.rb:33:in `<main>'
uncommon.mk:623: recipe for target 'yes-test-all' failed
make: *** [yes-test-all] Error 1
exit 2
failed(test/dbm)
== test/digest # 2018-08-10T22:23:22+09:00 (full)
...(snip 10 lines)...
Copyright (C) 2014 Free Software Foundation, Inc.
This is free software; see the source for copying conditions.  There is NO
warranty; not even for MERCHANTABILITY or FITNESS FOR A PARTICULAR PURPOSE.

./test/runner.rb:33:in `require': cannot load such file -- simplecov (LoadError)
	from ./test/runner.rb:33:in `<main>'
uncommon.mk:623: recipe for target 'yes-test-all' failed
make: *** [yes-test-all] Error 1
exit 2
failed(test/digest)
== test/drb # 2018-08-10T22:23:23+09:00 (full)
...(snip 10 lines)...
Copyright (C) 2014 Free Software Foundation, Inc.
This is free software; see the source for copying conditions.  There is NO
warranty; not even for MERCHANTABILITY or FITNESS FOR A PARTICULAR PURPOSE.

./test/runner.rb:33:in `require': cannot load such file -- simplecov (LoadError)
	from ./test/runner.rb:33:in `<main>'
uncommon.mk:623: recipe for target 'yes-test-all' failed
make: *** [yes-test-all] Error 1
exit 2
failed(test/drb)
== test/dtrace # 2018-08-10T22:23:24+09:00 (full)
...(snip 10 lines)...
Copyright (C) 2014 Free Software Foundation, Inc.
This is free software; see the source for copying conditions.  There is NO
warranty; not even for MERCHANTABILITY or FITNESS FOR A PARTICULAR PURPOSE.

./test/runner.rb:33:in `require': cannot load such file -- simplecov (LoadError)
	from ./test/runner.rb:33:in `<main>'
uncommon.mk:623: recipe for target 'yes-test-all' failed
make: *** [yes-test-all] Error 1
exit 2
failed(test/dtrace)
== test/erb # 2018-08-10T22:23:24+09:00 (full)
...(snip 10 lines)...
Copyright (C) 2014 Free Software Foundation, Inc.
This is free software; see the source for copying conditions.  There is NO
warranty; not even for MERCHANTABILITY or FITNESS FOR A PARTICULAR PURPOSE.

./test/runner.rb:33:in `require': cannot load such file -- simplecov (LoadError)
	from ./test/runner.rb:33:in `<main>'
uncommon.mk:623: recipe for target 'yes-test-all' failed
make: *** [yes-test-all] Error 1
exit 2
failed(test/erb)
== test/etc # 2018-08-10T22:23:25+09:00 (full)
...(snip 10 lines)...
Copyright (C) 2014 Free Software Foundation, Inc.
This is free software; see the source for copying conditions.  There is NO
warranty; not even for MERCHANTABILITY or FITNESS FOR A PARTICULAR PURPOSE.

./test/runner.rb:33:in `require': cannot load such file -- simplecov (LoadError)
	from ./test/runner.rb:33:in `<main>'
uncommon.mk:623: recipe for target 'yes-test-all' failed
make: *** [yes-test-all] Error 1
exit 2
failed(test/etc)
== test/excludes # 2018-08-10T22:23:26+09:00 (full)
...(snip 10 lines)...
Copyright (C) 2014 Free Software Foundation, Inc.
This is free software; see the source for copying conditions.  There is NO
warranty; not even for MERCHANTABILITY or FITNESS FOR A PARTICULAR PURPOSE.

./test/runner.rb:33:in `require': cannot load such file -- simplecov (LoadError)
	from ./test/runner.rb:33:in `<main>'
uncommon.mk:623: recipe for target 'yes-test-all' failed
make: *** [yes-test-all] Error 1
exit 2
failed(test/excludes)
== test/fiddle # 2018-08-10T22:23:27+09:00 (full)
...(snip 10 lines)...
Copyright (C) 2014 Free Software Foundation, Inc.
This is free software; see the source for copying conditions.  There is NO
warranty; not even for MERCHANTABILITY or FITNESS FOR A PARTICULAR PURPOSE.

./test/runner.rb:33:in `require': cannot load such file -- simplecov (LoadError)
	from ./test/runner.rb:33:in `<main>'
uncommon.mk:623: recipe for target 'yes-test-all' failed
make: *** [yes-test-all] Error 1
exit 2
failed(test/fiddle)
== test/fileutils # 2018-08-10T22:23:28+09:00 (full)
...(snip 10 lines)...
Copyright (C) 2014 Free Software Foundation, Inc.
This is free software; see the source for copying conditions.  There is NO
warranty; not even for MERCHANTABILITY or FITNESS FOR A PARTICULAR PURPOSE.

./test/runner.rb:33:in `require': cannot load such file -- simplecov (LoadError)
	from ./test/runner.rb:33:in `<main>'
uncommon.mk:623: recipe for target 'yes-test-all' failed
make: *** [yes-test-all] Error 1
exit 2
failed(test/fileutils)
== test/gdbm # 2018-08-10T22:23:28+09:00 (full)
...(snip 10 lines)...
Copyright (C) 2014 Free Software Foundation, Inc.
This is free software; see the source for copying conditions.  There is NO
warranty; not even for MERCHANTABILITY or FITNESS FOR A PARTICULAR PURPOSE.

./test/runner.rb:33:in `require': cannot load such file -- simplecov (LoadError)
	from ./test/runner.rb:33:in `<main>'
uncommon.mk:623: recipe for target 'yes-test-all' failed
make: *** [yes-test-all] Error 1
exit 2
failed(test/gdbm)
== test/io # 2018-08-10T22:23:29+09:00 (full)
...(snip 10 lines)...
Copyright (C) 2014 Free Software Foundation, Inc.
This is free software; see the source for copying conditions.  There is NO
warranty; not even for MERCHANTABILITY or FITNESS FOR A PARTICULAR PURPOSE.

./test/runner.rb:33:in `require': cannot load such file -- simplecov (LoadError)
	from ./test/runner.rb:33:in `<main>'
uncommon.mk:623: recipe for target 'yes-test-all' failed
make: *** [yes-test-all] Error 1
exit 2
failed(test/io)
== test/irb # 2018-08-10T22:23:30+09:00 (full)
...(snip 10 lines)...
Copyright (C) 2014 Free Software Foundation, Inc.
This is free software; see the source for copying conditions.  There is NO
warranty; not even for MERCHANTABILITY or FITNESS FOR A PARTICULAR PURPOSE.

./test/runner.rb:33:in `require': cannot load such file -- simplecov (LoadError)
	from ./test/runner.rb:33:in `<main>'
uncommon.mk:623: recipe for target 'yes-test-all' failed
make: *** [yes-test-all] Error 1
exit 2
failed(test/irb)
== test/json # 2018-08-10T22:23:31+09:00 (full)
...(snip 10 lines)...
Copyright (C) 2014 Free Software Foundation, Inc.
This is free software; see the source for copying conditions.  There is NO
warranty; not even for MERCHANTABILITY or FITNESS FOR A PARTICULAR PURPOSE.

./test/runner.rb:33:in `require': cannot load such file -- simplecov (LoadError)
	from ./test/runner.rb:33:in `<main>'
uncommon.mk:623: recipe for target 'yes-test-all' failed
make: *** [yes-test-all] Error 1
exit 2
failed(test/json)
== test/lib # 2018-08-10T22:23:32+09:00 (full)
...(snip 10 lines)...
Copyright (C) 2014 Free Software Foundation, Inc.
This is free software; see the source for copying conditions.  There is NO
warranty; not even for MERCHANTABILITY or FITNESS FOR A PARTICULAR PURPOSE.

./test/runner.rb:33:in `require': cannot load such file -- simplecov (LoadError)
	from ./test/runner.rb:33:in `<main>'
uncommon.mk:623: recipe for target 'yes-test-all' failed
make: *** [yes-test-all] Error 1
exit 2
failed(test/lib)
== test/logger # 2018-08-10T22:23:32+09:00 (full)
...(snip 10 lines)...
Copyright (C) 2014 Free Software Foundation, Inc.
This is free software; see the source for copying conditions.  There is NO
warranty; not even for MERCHANTABILITY or FITNESS FOR A PARTICULAR PURPOSE.

./test/runner.rb:33:in `require': cannot load such file -- simplecov (LoadError)
	from ./test/runner.rb:33:in `<main>'
uncommon.mk:623: recipe for target 'yes-test-all' failed
make: *** [yes-test-all] Error 1
exit 2
failed(test/logger)
== test/matrix # 2018-08-10T22:23:33+09:00 (full)
...(snip 10 lines)...
Copyright (C) 2014 Free Software Foundation, Inc.
This is free software; see the source for copying conditions.  There is NO
warranty; not even for MERCHANTABILITY or FITNESS FOR A PARTICULAR PURPOSE.

./test/runner.rb:33:in `require': cannot load such file -- simplecov (LoadError)
	from ./test/runner.rb:33:in `<main>'
uncommon.mk:623: recipe for target 'yes-test-all' failed
make: *** [yes-test-all] Error 1
exit 2
failed(test/matrix)
== test/minitest # 2018-08-10T22:23:34+09:00 (full)
...(snip 10 lines)...
Copyright (C) 2014 Free Software Foundation, Inc.
This is free software; see the source for copying conditions.  There is NO
warranty; not even for MERCHANTABILITY or FITNESS FOR A PARTICULAR PURPOSE.

./test/runner.rb:33:in `require': cannot load such file -- simplecov (LoadError)
	from ./test/runner.rb:33:in `<main>'
uncommon.mk:623: recipe for target 'yes-test-all' failed
make: *** [yes-test-all] Error 1
exit 2
failed(test/minitest)
== test/misc # 2018-08-10T22:23:35+09:00 (full)
...(snip 10 lines)...
Copyright (C) 2014 Free Software Foundation, Inc.
This is free software; see the source for copying conditions.  There is NO
warranty; not even for MERCHANTABILITY or FITNESS FOR A PARTICULAR PURPOSE.

./test/runner.rb:33:in `require': cannot load such file -- simplecov (LoadError)
	from ./test/runner.rb:33:in `<main>'
uncommon.mk:623: recipe for target 'yes-test-all' failed
make: *** [yes-test-all] Error 1
exit 2
failed(test/misc)
== test/mkmf # 2018-08-10T22:23:36+09:00 (full)
...(snip 10 lines)...
Copyright (C) 2014 Free Software Foundation, Inc.
This is free software; see the source for copying conditions.  There is NO
warranty; not even for MERCHANTABILITY or FITNESS FOR A PARTICULAR PURPOSE.

./test/runner.rb:33:in `require': cannot load such file -- simplecov (LoadError)
	from ./test/runner.rb:33:in `<main>'
uncommon.mk:623: recipe for target 'yes-test-all' failed
make: *** [yes-test-all] Error 1
exit 2
failed(test/mkmf)
== test/monitor # 2018-08-10T22:23:36+09:00 (full)
...(snip 10 lines)...
Copyright (C) 2014 Free Software Foundation, Inc.
This is free software; see the source for copying conditions.  There is NO
warranty; not even for MERCHANTABILITY or FITNESS FOR A PARTICULAR PURPOSE.

./test/runner.rb:33:in `require': cannot load such file -- simplecov (LoadError)
	from ./test/runner.rb:33:in `<main>'
uncommon.mk:623: recipe for target 'yes-test-all' failed
make: *** [yes-test-all] Error 1
exit 2
failed(test/monitor)
== test/net # 2018-08-10T22:23:37+09:00 (full)
...(snip 10 lines)...
Copyright (C) 2014 Free Software Foundation, Inc.
This is free software; see the source for copying conditions.  There is NO
warranty; not even for MERCHANTABILITY or FITNESS FOR A PARTICULAR PURPOSE.

./test/runner.rb:33:in `require': cannot load such file -- simplecov (LoadError)
	from ./test/runner.rb:33:in `<main>'
uncommon.mk:623: recipe for target 'yes-test-all' failed
make: *** [yes-test-all] Error 1
exit 2
failed(test/net)
== test/nkf # 2018-08-10T22:23:38+09:00 (full)
...(snip 10 lines)...
Copyright (C) 2014 Free Software Foundation, Inc.
This is free software; see the source for copying conditions.  There is NO
warranty; not even for MERCHANTABILITY or FITNESS FOR A PARTICULAR PURPOSE.

./test/runner.rb:33:in `require': cannot load such file -- simplecov (LoadError)
	from ./test/runner.rb:33:in `<main>'
uncommon.mk:623: recipe for target 'yes-test-all' failed
make: *** [yes-test-all] Error 1
exit 2
failed(test/nkf)
== test/objspace # 2018-08-10T22:23:39+09:00 (full)
...(snip 10 lines)...
Copyright (C) 2014 Free Software Foundation, Inc.
This is free software; see the source for copying conditions.  There is NO
warranty; not even for MERCHANTABILITY or FITNESS FOR A PARTICULAR PURPOSE.

./test/runner.rb:33:in `require': cannot load such file -- simplecov (LoadError)
	from ./test/runner.rb:33:in `<main>'
uncommon.mk:623: recipe for target 'yes-test-all' failed
make: *** [yes-test-all] Error 1
exit 2
failed(test/objspace)
== test/open-uri # 2018-08-10T22:23:40+09:00 (full)
...(snip 10 lines)...
Copyright (C) 2014 Free Software Foundation, Inc.
This is free software; see the source for copying conditions.  There is NO
warranty; not even for MERCHANTABILITY or FITNESS FOR A PARTICULAR PURPOSE.

./test/runner.rb:33:in `require': cannot load such file -- simplecov (LoadError)
	from ./test/runner.rb:33:in `<main>'
uncommon.mk:623: recipe for target 'yes-test-all' failed
make: *** [yes-test-all] Error 1
exit 2
failed(test/open-uri)
== test/openssl # 2018-08-10T22:23:40+09:00 (full)
...(snip 10 lines)...
Copyright (C) 2014 Free Software Foundation, Inc.
This is free software; see the source for copying conditions.  There is NO
warranty; not even for MERCHANTABILITY or FITNESS FOR A PARTICULAR PURPOSE.

./test/runner.rb:33:in `require': cannot load such file -- simplecov (LoadError)
	from ./test/runner.rb:33:in `<main>'
uncommon.mk:623: recipe for target 'yes-test-all' failed
make: *** [yes-test-all] Error 1
exit 2
failed(test/openssl)
== test/optparse # 2018-08-10T22:23:41+09:00 (full)
...(snip 10 lines)...
Copyright (C) 2014 Free Software Foundation, Inc.
This is free software; see the source for copying conditions.  There is NO
warranty; not even for MERCHANTABILITY or FITNESS FOR A PARTICULAR PURPOSE.

./test/runner.rb:33:in `require': cannot load such file -- simplecov (LoadError)
	from ./test/runner.rb:33:in `<main>'
uncommon.mk:623: recipe for target 'yes-test-all' failed
make: *** [yes-test-all] Error 1
exit 2
failed(test/optparse)
== test/ostruct # 2018-08-10T22:23:42+09:00 (full)
...(snip 10 lines)...
Copyright (C) 2014 Free Software Foundation, Inc.
This is free software; see the source for copying conditions.  There is NO
warranty; not even for MERCHANTABILITY or FITNESS FOR A PARTICULAR PURPOSE.

./test/runner.rb:33:in `require': cannot load such file -- simplecov (LoadError)
	from ./test/runner.rb:33:in `<main>'
uncommon.mk:623: recipe for target 'yes-test-all' failed
make: *** [yes-test-all] Error 1
exit 2
failed(test/ostruct)
== test/pathname # 2018-08-10T22:23:43+09:00 (full)
...(snip 10 lines)...
Copyright (C) 2014 Free Software Foundation, Inc.
This is free software; see the source for copying conditions.  There is NO
warranty; not even for MERCHANTABILITY or FITNESS FOR A PARTICULAR PURPOSE.

./test/runner.rb:33:in `require': cannot load such file -- simplecov (LoadError)
	from ./test/runner.rb:33:in `<main>'
uncommon.mk:623: recipe for target 'yes-test-all' failed
make: *** [yes-test-all] Error 1
exit 2
failed(test/pathname)
== test/psych # 2018-08-10T22:23:44+09:00 (full)
...(snip 10 lines)...
Copyright (C) 2014 Free Software Foundation, Inc.
This is free software; see the source for copying conditions.  There is NO
warranty; not even for MERCHANTABILITY or FITNESS FOR A PARTICULAR PURPOSE.

./test/runner.rb:33:in `require': cannot load such file -- simplecov (LoadError)
	from ./test/runner.rb:33:in `<main>'
uncommon.mk:623: recipe for target 'yes-test-all' failed
make: *** [yes-test-all] Error 1
exit 2
failed(test/psych)
== test/rdoc # 2018-08-10T22:23:45+09:00 (full)
...(snip 10 lines)...
Copyright (C) 2014 Free Software Foundation, Inc.
This is free software; see the source for copying conditions.  There is NO
warranty; not even for MERCHANTABILITY or FITNESS FOR A PARTICULAR PURPOSE.

./test/runner.rb:33:in `require': cannot load such file -- simplecov (LoadError)
	from ./test/runner.rb:33:in `<main>'
uncommon.mk:623: recipe for target 'yes-test-all' failed
make: *** [yes-test-all] Error 1
exit 2
failed(test/rdoc)
== test/readline # 2018-08-10T22:23:45+09:00 (full)
...(snip 10 lines)...
Copyright (C) 2014 Free Software Foundation, Inc.
This is free software; see the source for copying conditions.  There is NO
warranty; not even for MERCHANTABILITY or FITNESS FOR A PARTICULAR PURPOSE.

./test/runner.rb:33:in `require': cannot load such file -- simplecov (LoadError)
	from ./test/runner.rb:33:in `<main>'
uncommon.mk:623: recipe for target 'yes-test-all' failed
make: *** [yes-test-all] Error 1
exit 2
failed(test/readline)
== test/resolv # 2018-08-10T22:23:46+09:00 (full)
...(snip 10 lines)...
Copyright (C) 2014 Free Software Foundation, Inc.
This is free software; see the source for copying conditions.  There is NO
warranty; not even for MERCHANTABILITY or FITNESS FOR A PARTICULAR PURPOSE.

./test/runner.rb:33:in `require': cannot load such file -- simplecov (LoadError)
	from ./test/runner.rb:33:in `<main>'
uncommon.mk:623: recipe for target 'yes-test-all' failed
make: *** [yes-test-all] Error 1
exit 2
failed(test/resolv)
== test/rexml # 2018-08-10T22:23:47+09:00 (full)
...(snip 10 lines)...
Copyright (C) 2014 Free Software Foundation, Inc.
This is free software; see the source for copying conditions.  There is NO
warranty; not even for MERCHANTABILITY or FITNESS FOR A PARTICULAR PURPOSE.

./test/runner.rb:33:in `require': cannot load such file -- simplecov (LoadError)
	from ./test/runner.rb:33:in `<main>'
uncommon.mk:623: recipe for target 'yes-test-all' failed
make: *** [yes-test-all] Error 1
exit 2
failed(test/rexml)
== test/rinda # 2018-08-10T22:23:48+09:00 (full)
...(snip 10 lines)...
Copyright (C) 2014 Free Software Foundation, Inc.
This is free software; see the source for copying conditions.  There is NO
warranty; not even for MERCHANTABILITY or FITNESS FOR A PARTICULAR PURPOSE.

./test/runner.rb:33:in `require': cannot load such file -- simplecov (LoadError)
	from ./test/runner.rb:33:in `<main>'
uncommon.mk:623: recipe for target 'yes-test-all' failed
make: *** [yes-test-all] Error 1
exit 2
failed(test/rinda)
== test/ripper # 2018-08-10T22:23:49+09:00 (full)
...(snip 10 lines)...
Copyright (C) 2014 Free Software Foundation, Inc.
This is free software; see the source for copying conditions.  There is NO
warranty; not even for MERCHANTABILITY or FITNESS FOR A PARTICULAR PURPOSE.

./test/runner.rb:33:in `require': cannot load such file -- simplecov (LoadError)
	from ./test/runner.rb:33:in `<main>'
uncommon.mk:623: recipe for target 'yes-test-all' failed
make: *** [yes-test-all] Error 1
exit 2
failed(test/ripper)
== test/rss # 2018-08-10T22:23:50+09:00 (full)
...(snip 10 lines)...
Copyright (C) 2014 Free Software Foundation, Inc.
This is free software; see the source for copying conditions.  There is NO
warranty; not even for MERCHANTABILITY or FITNESS FOR A PARTICULAR PURPOSE.

./test/runner.rb:33:in `require': cannot load such file -- simplecov (LoadError)
	from ./test/runner.rb:33:in `<main>'
uncommon.mk:623: recipe for target 'yes-test-all' failed
make: *** [yes-test-all] Error 1
exit 2
failed(test/rss)
== test/ruby # 2018-08-10T22:23:50+09:00 (full)
...(snip 10 lines)...
Copyright (C) 2014 Free Software Foundation, Inc.
This is free software; see the source for copying conditions.  There is NO
warranty; not even for MERCHANTABILITY or FITNESS FOR A PARTICULAR PURPOSE.

./test/runner.rb:33:in `require': cannot load such file -- simplecov (LoadError)
	from ./test/runner.rb:33:in `<main>'
uncommon.mk:623: recipe for target 'yes-test-all' failed
make: *** [yes-test-all] Error 1
exit 2
failed(test/ruby)
== test/rubygems # 2018-08-10T22:23:51+09:00 (full)
...(snip 10 lines)...
Copyright (C) 2014 Free Software Foundation, Inc.
This is free software; see the source for copying conditions.  There is NO
warranty; not even for MERCHANTABILITY or FITNESS FOR A PARTICULAR PURPOSE.

./test/runner.rb:33:in `require': cannot load such file -- simplecov (LoadError)
	from ./test/runner.rb:33:in `<main>'
uncommon.mk:623: recipe for target 'yes-test-all' failed
make: *** [yes-test-all] Error 1
exit 2
failed(test/rubygems)
== test/scanf # 2018-08-10T22:23:52+09:00 (full)
...(snip 10 lines)...
Copyright (C) 2014 Free Software Foundation, Inc.
This is free software; see the source for copying conditions.  There is NO
warranty; not even for MERCHANTABILITY or FITNESS FOR A PARTICULAR PURPOSE.

./test/runner.rb:33:in `require': cannot load such file -- simplecov (LoadError)
	from ./test/runner.rb:33:in `<main>'
uncommon.mk:623: recipe for target 'yes-test-all' failed
make: *** [yes-test-all] Error 1
exit 2
failed(test/scanf)
== test/sdbm # 2018-08-10T22:23:53+09:00 (full)
...(snip 10 lines)...
Copyright (C) 2014 Free Software Foundation, Inc.
This is free software; see the source for copying conditions.  There is NO
warranty; not even for MERCHANTABILITY or FITNESS FOR A PARTICULAR PURPOSE.

./test/runner.rb:33:in `require': cannot load such file -- simplecov (LoadError)
	from ./test/runner.rb:33:in `<main>'
uncommon.mk:623: recipe for target 'yes-test-all' failed
make: *** [yes-test-all] Error 1
exit 2
failed(test/sdbm)
== test/shell # 2018-08-10T22:23:54+09:00 (full)
...(snip 10 lines)...
Copyright (C) 2014 Free Software Foundation, Inc.
This is free software; see the source for copying conditions.  There is NO
warranty; not even for MERCHANTABILITY or FITNESS FOR A PARTICULAR PURPOSE.

./test/runner.rb:33:in `require': cannot load such file -- simplecov (LoadError)
	from ./test/runner.rb:33:in `<main>'
uncommon.mk:623: recipe for target 'yes-test-all' failed
make: *** [yes-test-all] Error 1
exit 2
failed(test/shell)
== test/socket # 2018-08-10T22:23:54+09:00 (full)
...(snip 10 lines)...
Copyright (C) 2014 Free Software Foundation, Inc.
This is free software; see the source for copying conditions.  There is NO
warranty; not even for MERCHANTABILITY or FITNESS FOR A PARTICULAR PURPOSE.

./test/runner.rb:33:in `require': cannot load such file -- simplecov (LoadError)
	from ./test/runner.rb:33:in `<main>'
uncommon.mk:623: recipe for target 'yes-test-all' failed
make: *** [yes-test-all] Error 1
exit 2
failed(test/socket)
== test/stringio # 2018-08-10T22:23:55+09:00 (full)
...(snip 10 lines)...
Copyright (C) 2014 Free Software Foundation, Inc.
This is free software; see the source for copying conditions.  There is NO
warranty; not even for MERCHANTABILITY or FITNESS FOR A PARTICULAR PURPOSE.

./test/runner.rb:33:in `require': cannot load such file -- simplecov (LoadError)
	from ./test/runner.rb:33:in `<main>'
uncommon.mk:623: recipe for target 'yes-test-all' failed
make: *** [yes-test-all] Error 1
exit 2
failed(test/stringio)
== test/strscan # 2018-08-10T22:23:56+09:00 (full)
...(snip 10 lines)...
Copyright (C) 2014 Free Software Foundation, Inc.
This is free software; see the source for copying conditions.  There is NO
warranty; not even for MERCHANTABILITY or FITNESS FOR A PARTICULAR PURPOSE.

./test/runner.rb:33:in `require': cannot load such file -- simplecov (LoadError)
	from ./test/runner.rb:33:in `<main>'
uncommon.mk:623: recipe for target 'yes-test-all' failed
make: *** [yes-test-all] Error 1
exit 2
failed(test/strscan)
== test/syslog # 2018-08-10T22:23:57+09:00 (full)
...(snip 10 lines)...
Copyright (C) 2014 Free Software Foundation, Inc.
This is free software; see the source for copying conditions.  There is NO
warranty; not even for MERCHANTABILITY or FITNESS FOR A PARTICULAR PURPOSE.

./test/runner.rb:33:in `require': cannot load such file -- simplecov (LoadError)
	from ./test/runner.rb:33:in `<main>'
uncommon.mk:623: recipe for target 'yes-test-all' failed
make: *** [yes-test-all] Error 1
exit 2
failed(test/syslog)
== test/test_abbrev.rb # 2018-08-10T22:23:58+09:00 (full)
...(snip 10 lines)...
Copyright (C) 2014 Free Software Foundation, Inc.
This is free software; see the source for copying conditions.  There is NO
warranty; not even for MERCHANTABILITY or FITNESS FOR A PARTICULAR PURPOSE.

./test/runner.rb:33:in `require': cannot load such file -- simplecov (LoadError)
	from ./test/runner.rb:33:in `<main>'
uncommon.mk:623: recipe for target 'yes-test-all' failed
make: *** [yes-test-all] Error 1
exit 2
failed(test/test_abbrev.rb)
== test/test_cmath.rb # 2018-08-10T22:23:58+09:00 (full)
...(snip 10 lines)...
Copyright (C) 2014 Free Software Foundation, Inc.
This is free software; see the source for copying conditions.  There is NO
warranty; not even for MERCHANTABILITY or FITNESS FOR A PARTICULAR PURPOSE.

./test/runner.rb:33:in `require': cannot load such file -- simplecov (LoadError)
	from ./test/runner.rb:33:in `<main>'
uncommon.mk:623: recipe for target 'yes-test-all' failed
make: *** [yes-test-all] Error 1
exit 2
failed(test/test_cmath.rb)
== test/test_delegate.rb # 2018-08-10T22:23:59+09:00 (full)
...(snip 10 lines)...
Copyright (C) 2014 Free Software Foundation, Inc.
This is free software; see the source for copying conditions.  There is NO
warranty; not even for MERCHANTABILITY or FITNESS FOR A PARTICULAR PURPOSE.

./test/runner.rb:33:in `require': cannot load such file -- simplecov (LoadError)
	from ./test/runner.rb:33:in `<main>'
uncommon.mk:623: recipe for target 'yes-test-all' failed
make: *** [yes-test-all] Error 1
exit 2
failed(test/test_delegate.rb)
== test/test_find.rb # 2018-08-10T22:24:00+09:00 (full)
...(snip 10 lines)...
Copyright (C) 2014 Free Software Foundation, Inc.
This is free software; see the source for copying conditions.  There is NO
warranty; not even for MERCHANTABILITY or FITNESS FOR A PARTICULAR PURPOSE.

./test/runner.rb:33:in `require': cannot load such file -- simplecov (LoadError)
	from ./test/runner.rb:33:in `<main>'
uncommon.mk:623: recipe for target 'yes-test-all' failed
make: *** [yes-test-all] Error 1
exit 2
failed(test/test_find.rb)
== test/test_forwardable.rb # 2018-08-10T22:24:01+09:00 (full)
...(snip 10 lines)...
Copyright (C) 2014 Free Software Foundation, Inc.
This is free software; see the source for copying conditions.  There is NO
warranty; not even for MERCHANTABILITY or FITNESS FOR A PARTICULAR PURPOSE.

./test/runner.rb:33:in `require': cannot load such file -- simplecov (LoadError)
	from ./test/runner.rb:33:in `<main>'
uncommon.mk:623: recipe for target 'yes-test-all' failed
make: *** [yes-test-all] Error 1
exit 2
failed(test/test_forwardable.rb)
== test/test_ipaddr.rb # 2018-08-10T22:24:02+09:00 (full)
...(snip 10 lines)...
Copyright (C) 2014 Free Software Foundation, Inc.
This is free software; see the source for copying conditions.  There is NO
warranty; not even for MERCHANTABILITY or FITNESS FOR A PARTICULAR PURPOSE.

./test/runner.rb:33:in `require': cannot load such file -- simplecov (LoadError)
	from ./test/runner.rb:33:in `<main>'
uncommon.mk:623: recipe for target 'yes-test-all' failed
make: *** [yes-test-all] Error 1
exit 2
failed(test/test_ipaddr.rb)
== test/test_mathn.rb # 2018-08-10T22:24:02+09:00 (full)
...(snip 10 lines)...
Copyright (C) 2014 Free Software Foundation, Inc.
This is free software; see the source for copying conditions.  There is NO
warranty; not even for MERCHANTABILITY or FITNESS FOR A PARTICULAR PURPOSE.

./test/runner.rb:33:in `require': cannot load such file -- simplecov (LoadError)
	from ./test/runner.rb:33:in `<main>'
uncommon.mk:623: recipe for target 'yes-test-all' failed
make: *** [yes-test-all] Error 1
exit 2
failed(test/test_mathn.rb)
== test/test_mutex_m.rb # 2018-08-10T22:24:03+09:00 (full)
...(snip 10 lines)...
Copyright (C) 2014 Free Software Foundation, Inc.
This is free software; see the source for copying conditions.  There is NO
warranty; not even for MERCHANTABILITY or FITNESS FOR A PARTICULAR PURPOSE.

./test/runner.rb:33:in `require': cannot load such file -- simplecov (LoadError)
	from ./test/runner.rb:33:in `<main>'
uncommon.mk:623: recipe for target 'yes-test-all' failed
make: *** [yes-test-all] Error 1
exit 2
failed(test/test_mutex_m.rb)
== test/test_observer.rb # 2018-08-10T22:24:04+09:00 (full)
...(snip 10 lines)...
Copyright (C) 2014 Free Software Foundation, Inc.
This is free software; see the source for copying conditions.  There is NO
warranty; not even for MERCHANTABILITY or FITNESS FOR A PARTICULAR PURPOSE.

./test/runner.rb:33:in `require': cannot load such file -- simplecov (LoadError)
	from ./test/runner.rb:33:in `<main>'
uncommon.mk:623: recipe for target 'yes-test-all' failed
make: *** [yes-test-all] Error 1
exit 2
failed(test/test_observer.rb)
== test/test_open3.rb # 2018-08-10T22:24:05+09:00 (full)
...(snip 10 lines)...
Copyright (C) 2014 Free Software Foundation, Inc.
This is free software; see the source for copying conditions.  There is NO
warranty; not even for MERCHANTABILITY or FITNESS FOR A PARTICULAR PURPOSE.

./test/runner.rb:33:in `require': cannot load such file -- simplecov (LoadError)
	from ./test/runner.rb:33:in `<main>'
uncommon.mk:623: recipe for target 'yes-test-all' failed
make: *** [yes-test-all] Error 1
exit 2
failed(test/test_open3.rb)
== test/test_pp.rb # 2018-08-10T22:24:06+09:00 (full)
...(snip 10 lines)...
Copyright (C) 2014 Free Software Foundation, Inc.
This is free software; see the source for copying conditions.  There is NO
warranty; not even for MERCHANTABILITY or FITNESS FOR A PARTICULAR PURPOSE.

./test/runner.rb:33:in `require': cannot load such file -- simplecov (LoadError)
	from ./test/runner.rb:33:in `<main>'
uncommon.mk:623: recipe for target 'yes-test-all' failed
make: *** [yes-test-all] Error 1
exit 2
failed(test/test_pp.rb)
== test/test_prettyprint.rb # 2018-08-10T22:24:06+09:00 (full)
...(snip 10 lines)...
Copyright (C) 2014 Free Software Foundation, Inc.
This is free software; see the source for copying conditions.  There is NO
warranty; not even for MERCHANTABILITY or FITNESS FOR A PARTICULAR PURPOSE.

./test/runner.rb:33:in `require': cannot load such file -- simplecov (LoadError)
	from ./test/runner.rb:33:in `<main>'
uncommon.mk:623: recipe for target 'yes-test-all' failed
make: *** [yes-test-all] Error 1
exit 2
failed(test/test_prettyprint.rb)
== test/test_prime.rb # 2018-08-10T22:24:07+09:00 (full)
...(snip 10 lines)...
Copyright (C) 2014 Free Software Foundation, Inc.
This is free software; see the source for copying conditions.  There is NO
warranty; not even for MERCHANTABILITY or FITNESS FOR A PARTICULAR PURPOSE.

./test/runner.rb:33:in `require': cannot load such file -- simplecov (LoadError)
	from ./test/runner.rb:33:in `<main>'
uncommon.mk:623: recipe for target 'yes-test-all' failed
make: *** [yes-test-all] Error 1
exit 2
failed(test/test_prime.rb)
== test/test_pstore.rb # 2018-08-10T22:24:08+09:00 (full)
...(snip 10 lines)...
Copyright (C) 2014 Free Software Foundation, Inc.
This is free software; see the source for copying conditions.  There is NO
warranty; not even for MERCHANTABILITY or FITNESS FOR A PARTICULAR PURPOSE.

./test/runner.rb:33:in `require': cannot load such file -- simplecov (LoadError)
	from ./test/runner.rb:33:in `<main>'
uncommon.mk:623: recipe for target 'yes-test-all' failed
make: *** [yes-test-all] Error 1
exit 2
failed(test/test_pstore.rb)
== test/test_pty.rb # 2018-08-10T22:24:09+09:00 (full)
...(snip 10 lines)...
Copyright (C) 2014 Free Software Foundation, Inc.
This is free software; see the source for copying conditions.  There is NO
warranty; not even for MERCHANTABILITY or FITNESS FOR A PARTICULAR PURPOSE.

./test/runner.rb:33:in `require': cannot load such file -- simplecov (LoadError)
	from ./test/runner.rb:33:in `<main>'
uncommon.mk:623: recipe for target 'yes-test-all' failed
make: *** [yes-test-all] Error 1
exit 2
failed(test/test_pty.rb)
== test/test_rbconfig.rb # 2018-08-10T22:24:10+09:00 (full)
...(snip 10 lines)...
Copyright (C) 2014 Free Software Foundation, Inc.
This is free software; see the source for copying conditions.  There is NO
warranty; not even for MERCHANTABILITY or FITNESS FOR A PARTICULAR PURPOSE.

./test/runner.rb:33:in `require': cannot load such file -- simplecov (LoadError)
	from ./test/runner.rb:33:in `<main>'
uncommon.mk:623: recipe for target 'yes-test-all' failed
make: *** [yes-test-all] Error 1
exit 2
failed(test/test_rbconfig.rb)
== test/test_securerandom.rb # 2018-08-10T22:24:10+09:00 (full)
...(snip 10 lines)...
Copyright (C) 2014 Free Software Foundation, Inc.
This is free software; see the source for copying conditions.  There is NO
warranty; not even for MERCHANTABILITY or FITNESS FOR A PARTICULAR PURPOSE.

./test/runner.rb:33:in `require': cannot load such file -- simplecov (LoadError)
	from ./test/runner.rb:33:in `<main>'
uncommon.mk:623: recipe for target 'yes-test-all' failed
make: *** [yes-test-all] Error 1
exit 2
failed(test/test_securerandom.rb)
== test/test_set.rb # 2018-08-10T22:24:11+09:00 (full)
...(snip 10 lines)...
Copyright (C) 2014 Free Software Foundation, Inc.
This is free software; see the source for copying conditions.  There is NO
warranty; not even for MERCHANTABILITY or FITNESS FOR A PARTICULAR PURPOSE.

./test/runner.rb:33:in `require': cannot load such file -- simplecov (LoadError)
	from ./test/runner.rb:33:in `<main>'
uncommon.mk:623: recipe for target 'yes-test-all' failed
make: *** [yes-test-all] Error 1
exit 2
failed(test/test_set.rb)
== test/test_shellwords.rb # 2018-08-10T22:24:12+09:00 (full)
...(snip 10 lines)...
Copyright (C) 2014 Free Software Foundation, Inc.
This is free software; see the source for copying conditions.  There is NO
warranty; not even for MERCHANTABILITY or FITNESS FOR A PARTICULAR PURPOSE.

./test/runner.rb:33:in `require': cannot load such file -- simplecov (LoadError)
	from ./test/runner.rb:33:in `<main>'
uncommon.mk:623: recipe for target 'yes-test-all' failed
make: *** [yes-test-all] Error 1
exit 2
failed(test/test_shellwords.rb)
== test/test_singleton.rb # 2018-08-10T22:24:13+09:00 (full)
...(snip 10 lines)...
Copyright (C) 2014 Free Software Foundation, Inc.
This is free software; see the source for copying conditions.  There is NO
warranty; not even for MERCHANTABILITY or FITNESS FOR A PARTICULAR PURPOSE.

./test/runner.rb:33:in `require': cannot load such file -- simplecov (LoadError)
	from ./test/runner.rb:33:in `<main>'
uncommon.mk:623: recipe for target 'yes-test-all' failed
make: *** [yes-test-all] Error 1
exit 2
failed(test/test_singleton.rb)
== test/test_syslog.rb # 2018-08-10T22:24:14+09:00 (full)
...(snip 10 lines)...
Copyright (C) 2014 Free Software Foundation, Inc.
This is free software; see the source for copying conditions.  There is NO
warranty; not even for MERCHANTABILITY or FITNESS FOR A PARTICULAR PURPOSE.

./test/runner.rb:33:in `require': cannot load such file -- simplecov (LoadError)
	from ./test/runner.rb:33:in `<main>'
uncommon.mk:623: recipe for target 'yes-test-all' failed
make: *** [yes-test-all] Error 1
exit 2
failed(test/test_syslog.rb)
== test/test_tempfile.rb # 2018-08-10T22:24:15+09:00 (full)
...(snip 10 lines)...
Copyright (C) 2014 Free Software Foundation, Inc.
This is free software; see the source for copying conditions.  There is NO
warranty; not even for MERCHANTABILITY or FITNESS FOR A PARTICULAR PURPOSE.

./test/runner.rb:33:in `require': cannot load such file -- simplecov (LoadError)
	from ./test/runner.rb:33:in `<main>'
uncommon.mk:623: recipe for target 'yes-test-all' failed
make: *** [yes-test-all] Error 1
exit 2
failed(test/test_tempfile.rb)
== test/test_time.rb # 2018-08-10T22:24:15+09:00 (full)
...(snip 10 lines)...
Copyright (C) 2014 Free Software Foundation, Inc.
This is free software; see the source for copying conditions.  There is NO
warranty; not even for MERCHANTABILITY or FITNESS FOR A PARTICULAR PURPOSE.

./test/runner.rb:33:in `require': cannot load such file -- simplecov (LoadError)
	from ./test/runner.rb:33:in `<main>'
uncommon.mk:623: recipe for target 'yes-test-all' failed
make: *** [yes-test-all] Error 1
exit 2
failed(test/test_time.rb)
== test/test_timeout.rb # 2018-08-10T22:24:16+09:00 (full)
...(snip 10 lines)...
Copyright (C) 2014 Free Software Foundation, Inc.
This is free software; see the source for copying conditions.  There is NO
warranty; not even for MERCHANTABILITY or FITNESS FOR A PARTICULAR PURPOSE.

./test/runner.rb:33:in `require': cannot load such file -- simplecov (LoadError)
	from ./test/runner.rb:33:in `<main>'
uncommon.mk:623: recipe for target 'yes-test-all' failed
make: *** [yes-test-all] Error 1
exit 2
failed(test/test_timeout.rb)
== test/test_tmpdir.rb # 2018-08-10T22:24:17+09:00 (full)
...(snip 10 lines)...
Copyright (C) 2014 Free Software Foundation, Inc.
This is free software; see the source for copying conditions.  There is NO
warranty; not even for MERCHANTABILITY or FITNESS FOR A PARTICULAR PURPOSE.

./test/runner.rb:33:in `require': cannot load such file -- simplecov (LoadError)
	from ./test/runner.rb:33:in `<main>'
uncommon.mk:623: recipe for target 'yes-test-all' failed
make: *** [yes-test-all] Error 1
exit 2
failed(test/test_tmpdir.rb)
== test/test_tracer.rb # 2018-08-10T22:24:18+09:00 (full)
...(snip 10 lines)...
Copyright (C) 2014 Free Software Foundation, Inc.
This is free software; see the source for copying conditions.  There is NO
warranty; not even for MERCHANTABILITY or FITNESS FOR A PARTICULAR PURPOSE.

./test/runner.rb:33:in `require': cannot load such file -- simplecov (LoadError)
	from ./test/runner.rb:33:in `<main>'
uncommon.mk:623: recipe for target 'yes-test-all' failed
make: *** [yes-test-all] Error 1
exit 2
failed(test/test_tracer.rb)
== test/test_tsort.rb # 2018-08-10T22:24:19+09:00 (full)
...(snip 10 lines)...
Copyright (C) 2014 Free Software Foundation, Inc.
This is free software; see the source for copying conditions.  There is NO
warranty; not even for MERCHANTABILITY or FITNESS FOR A PARTICULAR PURPOSE.

./test/runner.rb:33:in `require': cannot load such file -- simplecov (LoadError)
	from ./test/runner.rb:33:in `<main>'
uncommon.mk:623: recipe for target 'yes-test-all' failed
make: *** [yes-test-all] Error 1
exit 2
failed(test/test_tsort.rb)
== test/test_unicode_normalize.rb # 2018-08-10T22:24:19+09:00 (full)
...(snip 10 lines)...
Copyright (C) 2014 Free Software Foundation, Inc.
This is free software; see the source for copying conditions.  There is NO
warranty; not even for MERCHANTABILITY or FITNESS FOR A PARTICULAR PURPOSE.

./test/runner.rb:33:in `require': cannot load such file -- simplecov (LoadError)
	from ./test/runner.rb:33:in `<main>'
uncommon.mk:623: recipe for target 'yes-test-all' failed
make: *** [yes-test-all] Error 1
exit 2
failed(test/test_unicode_normalize.rb)
== test/test_weakref.rb # 2018-08-10T22:24:20+09:00 (full)
...(snip 10 lines)...
Copyright (C) 2014 Free Software Foundation, Inc.
This is free software; see the source for copying conditions.  There is NO
warranty; not even for MERCHANTABILITY or FITNESS FOR A PARTICULAR PURPOSE.

./test/runner.rb:33:in `require': cannot load such file -- simplecov (LoadError)
	from ./test/runner.rb:33:in `<main>'
uncommon.mk:623: recipe for target 'yes-test-all' failed
make: *** [yes-test-all] Error 1
exit 2
failed(test/test_weakref.rb)
== test/test_win32api.rb # 2018-08-10T22:24:21+09:00 (full)
...(snip 10 lines)...
Copyright (C) 2014 Free Software Foundation, Inc.
This is free software; see the source for copying conditions.  There is NO
warranty; not even for MERCHANTABILITY or FITNESS FOR A PARTICULAR PURPOSE.

./test/runner.rb:33:in `require': cannot load such file -- simplecov (LoadError)
	from ./test/runner.rb:33:in `<main>'
uncommon.mk:623: recipe for target 'yes-test-all' failed
make: *** [yes-test-all] Error 1
exit 2
failed(test/test_win32api.rb)
== test/testunit # 2018-08-10T22:24:22+09:00 (full)
...(snip 10 lines)...
Copyright (C) 2014 Free Software Foundation, Inc.
This is free software; see the source for copying conditions.  There is NO
warranty; not even for MERCHANTABILITY or FITNESS FOR A PARTICULAR PURPOSE.

./test/runner.rb:33:in `require': cannot load such file -- simplecov (LoadError)
	from ./test/runner.rb:33:in `<main>'
uncommon.mk:623: recipe for target 'yes-test-all' failed
make: *** [yes-test-all] Error 1
exit 2
failed(test/testunit)
== test/thread # 2018-08-10T22:24:22+09:00 (full)
...(snip 10 lines)...
Copyright (C) 2014 Free Software Foundation, Inc.
This is free software; see the source for copying conditions.  There is NO
warranty; not even for MERCHANTABILITY or FITNESS FOR A PARTICULAR PURPOSE.

./test/runner.rb:33:in `require': cannot load such file -- simplecov (LoadError)
	from ./test/runner.rb:33:in `<main>'
uncommon.mk:623: recipe for target 'yes-test-all' failed
make: *** [yes-test-all] Error 1
exit 2
failed(test/thread)
== test/uri # 2018-08-10T22:24:23+09:00 (full)
...(snip 10 lines)...
Copyright (C) 2014 Free Software Foundation, Inc.
This is free software; see the source for copying conditions.  There is NO
warranty; not even for MERCHANTABILITY or FITNESS FOR A PARTICULAR PURPOSE.

./test/runner.rb:33:in `require': cannot load such file -- simplecov (LoadError)
	from ./test/runner.rb:33:in `<main>'
uncommon.mk:623: recipe for target 'yes-test-all' failed
make: *** [yes-test-all] Error 1
exit 2
failed(test/uri)
== test/webrick # 2018-08-10T22:24:24+09:00 (full)
...(snip 10 lines)...
Copyright (C) 2014 Free Software Foundation, Inc.
This is free software; see the source for copying conditions.  There is NO
warranty; not even for MERCHANTABILITY or FITNESS FOR A PARTICULAR PURPOSE.

./test/runner.rb:33:in `require': cannot load such file -- simplecov (LoadError)
	from ./test/runner.rb:33:in `<main>'
uncommon.mk:623: recipe for target 'yes-test-all' failed
make: *** [yes-test-all] Error 1
exit 2
failed(test/webrick)
== test/win32ole # 2018-08-10T22:24:25+09:00 (full)
...(snip 10 lines)...
Copyright (C) 2014 Free Software Foundation, Inc.
This is free software; see the source for copying conditions.  There is NO
warranty; not even for MERCHANTABILITY or FITNESS FOR A PARTICULAR PURPOSE.

./test/runner.rb:33:in `require': cannot load such file -- simplecov (LoadError)
	from ./test/runner.rb:33:in `<main>'
uncommon.mk:623: recipe for target 'yes-test-all' failed
make: *** [yes-test-all] Error 1
exit 2
failed(test/win32ole)
== test/yaml # 2018-08-10T22:24:26+09:00 (full)
...(snip 10 lines)...
Copyright (C) 2014 Free Software Foundation, Inc.
This is free software; see the source for copying conditions.  There is NO
warranty; not even for MERCHANTABILITY or FITNESS FOR A PARTICULAR PURPOSE.

./test/runner.rb:33:in `require': cannot load such file -- simplecov (LoadError)
	from ./test/runner.rb:33:in `<main>'
uncommon.mk:623: recipe for target 'yes-test-all' failed
make: *** [yes-test-all] Error 1
exit 2
failed(test/yaml)
== test/zlib # 2018-08-10T22:24:26+09:00 (full)
...(snip 10 lines)...
Copyright (C) 2014 Free Software Foundation, Inc.
This is free software; see the source for copying conditions.  There is NO
warranty; not even for MERCHANTABILITY or FITNESS FOR A PARTICULAR PURPOSE.

./test/runner.rb:33:in `require': cannot load such file -- simplecov (LoadError)
	from ./test/runner.rb:33:in `<main>'
uncommon.mk:623: recipe for target 'yes-test-all' failed
make: *** [yes-test-all] Error 1
exit 2
failed(test/zlib)
== rubyspec # 2018-08-10T22:24:27+09:00 (full)
...(snip 49452 lines)...
- UNIXSocket.open by raising an exception when there is a NUL byte

/home/hsbt/chkbuild/tmp/build/20180810T131532Z/rubyspec/security/cve_2018_8780_spec.rb                                             
CVE-2018-8780 is resisted by
- Dir.glob by raising an exception when there is a NUL byte
- Dir.entries by raising an exception when there is a NUL byte
- Dir.foreach by raising an exception when there is a NUL byte
- Dir.empty? by raising an exception when there is a NUL byte


1)
Addrinfo.getaddrinfo sets a custom protocol family of the Addrinfo instances ERROR
SocketError: getaddrinfo: Name or service not known
/home/hsbt/chkbuild/tmp/build/20180810T131532Z/rubyspec/library/socket/addrinfo/getaddrinfo_spec.rb:40:in `getaddrinfo'
/home/hsbt/chkbuild/tmp/build/20180810T131532Z/rubyspec/library/socket/addrinfo/getaddrinfo_spec.rb:40:in `block (3 levels) in <top (required)>'
/home/hsbt/chkbuild/tmp/build/20180810T131532Z/rubyspec/library/socket/addrinfo/getaddrinfo_spec.rb:4:in `<top (required)>'

2)
Addrinfo.getaddrinfo sets a corresponding address family based on a custom protocol family ERROR
SocketError: getaddrinfo: Name or service not known
/home/hsbt/chkbuild/tmp/build/20180810T131532Z/rubyspec/library/socket/addrinfo/getaddrinfo_spec.rb:46:in `getaddrinfo'
/home/hsbt/chkbuild/tmp/build/20180810T131532Z/rubyspec/library/socket/addrinfo/getaddrinfo_spec.rb:46:in `block (3 levels) in <top (required)>'
/home/hsbt/chkbuild/tmp/build/20180810T131532Z/rubyspec/library/socket/addrinfo/getaddrinfo_spec.rb:4:in `<top (required)>'

Finished in 79.487959 seconds

3690 files, 29551 examples, 208852 expectations, 0 failures, 2 errors, 0 tagged
exit 1
failed(rubyspec)

20180810T101540Z(failure) < OlderDiff < 20180810T131532Z(failure) > NewerDiff > 20180810T161509Z(failure)


chkbuild summary recent last