r64223 ruby 2.6.0dev (2018-08-08) [x86_64-darwin16] (osx1012) 430W [SIGBUS] [SIGILL] 2F3E failed(rubyspec CommandTimeout)

chkbuild summary recent last

OlderDiff < 20180807T214501Z(failure) < ThisDiff > 20180808T014501Z(failure) > NewerDiff

OLDREV 64222
NEWREV 64223
CHG spec/ruby/library/socket/basicsocket/send_spec.rb	64180->64223
CHG spec/ruby/library/socket/socket/accept_spec.rb	64180->64223
CHG spec/ruby/library/socket/socket/sysaccept_spec.rb	64180->64223

===================================================================
+++ 20180808T014501Z
@@ 750 @@
 ---
 Configuration summary for ruby version 2.6.0
 
+   * Installation prefix: /Users/hsbt/Documents/cb/tmp/build/20180808T014501\
                           Z
    * exec prefix:         ${prefix}
    * arch:                x86_64-darwin16
@@ 8427 @@
 [n/n] FTPTest#test_read_timeout_not_exceeded = <elapsed> s
 [n/n] FTPTest#test_retrbinary_fail = <elapsed> s
 [n/n] FTPTest#test_retrbinary_read_timeout_exceeded = <elapsed> s
+[n/n] FTPTest#test_retrbinary_read_timeout_not_exceeded#<Thread:<address>@<build-dir>/ruby/test/net/ftp/test_ftp.rb:2354 run> terminated with exception (report_on_exception is true):
+<build-dir>/ruby/test/net/ftp/test_ftp.rb:<line_a>:in `write': Broken pipe (Errno::EPIPE)
+	from <build-dir>/ruby/test/net/ftp/test_ftp.rb:<line_a>:in `print'
+	from <build-dir>/ruby/test/net/ftp/test_ftp.rb:<line_a>:in `block (2 levels) in test_retrbinary_read_timeout_not_exceeded'
+	from <build-dir>/ruby/test/net/ftp/test_ftp.rb:<line_a>:in `scan'
+	from <build-dir>/ruby/test/net/ftp/test_ftp.rb:<line_a>:in `block in test_retrbinary_read_timeout_not_exceeded'
+	from <build-dir>/ruby/test/net/ftp/test_ftp.rb:<line_a>:in `block in create_ftp_server'
  = <elapsed> s
 [n/n] FTPTest#test_retrlines = <elapsed> s
 [n/n] FTPTest#test_s_new_timeout_options = <elapsed> s
@@ 27854 @@
  <n>) Failure:
 Fiddle::TestFunction#test_nogvl_poll [<build-dir>/ruby/test/fiddle/test_function.rb:89]:
 slept amount of time.
+Expected |200 - 351| (151) to be <= 100.
 
  <n>) Failure:
+TestWEBrickUtils#test_nested_timeout_outer [<build-dir>/ruby/test/webrick/test_utils.rb:42]:
+<2> expected but was
+<1>.
 
  <n>) Error:
 FTPTest#test_read_timeout_not_exceeded:
@@ 27871 @@
     <build-dir>/ruby/lib/net/ftp.rb:<line_a>:in `getline'
     <build-dir>/ruby/lib/net/ftp.rb:<line_a>:in `getmultiline'
     <build-dir>/ruby/lib/net/ftp.rb:<line_a>:in `getresp'
+    <build-dir>/ruby/lib/net/ftp.rb:<line_a>:in `block in sendcmd'
     <build-dir>/ruby/lib/monitor.rb:<line_a>:in `mon_synchronize'
+    <build-dir>/ruby/lib/net/ftp.rb:<line_a>:in `sendcmd'
+    <build-dir>/ruby/lib/net/ftp.rb:<line_a>:in `block in login'
     <build-dir>/ruby/lib/monitor.rb:<line_a>:in `mon_synchronize'
     <build-dir>/ruby/lib/net/ftp.rb:<line_a>:in `login'
     <build-dir>/ruby/test/net/ftp/test_ftp.rb:<line_a>:in `test_read_timeout_not_exceeded'
 
  <n>) Error:
+FTPTest#test_retrbinary_read_timeout_not_exceeded:
 Net::ReadTimeout: Net::ReadTimeout
     <build-dir>/ruby/lib/net/protocol.rb:<line_a>:in `rbuf_fill'
+    <build-dir>/ruby/lib/net/protocol.rb:<line_a>:in `read'
+    <build-dir>/ruby/lib/net/ftp.rb:<line_a>:in `read'
+    <build-dir>/ruby/lib/net/ftp.rb:<line_a>:in `block (3 levels) in retrbinary'
+    <build-dir>/ruby/lib/net/ftp.rb:<line_a>:in `loop'
+    <build-dir>/ruby/lib/net/ftp.rb:<line_a>:in `block (2 levels) in retrbinary'
+    <build-dir>/ruby/lib/net/ftp.rb:<line_a>:in `with_binary'
+    <build-dir>/ruby/lib/net/ftp.rb:<line_a>:in `block in retrbinary'
     <build-dir>/ruby/lib/monitor.rb:<line_a>:in `mon_synchronize'
+    <build-dir>/ruby/lib/net/ftp.rb:<line_a>:in `retrbinary'
+    <build-dir>/ruby/test/net/ftp/test_ftp.rb:<line_a>:in `test_retrbinary_read_timeout_not_exceeded'
 
  <n>) Error:
+FTPTest#test_retrbinary_read_timeout_not_exceeded:
+Errno::EPIPE: Broken pipe
+    <build-dir>/ruby/test/net/ftp/test_ftp.rb:<line_a>:in `write'
+    <build-dir>/ruby/test/net/ftp/test_ftp.rb:<line_a>:in `print'
+    <build-dir>/ruby/test/net/ftp/test_ftp.rb:<line_a>:in `block (2 levels) in test_retrbinary_read_timeout_not_exceeded'
+    <build-dir>/ruby/test/net/ftp/test_ftp.rb:<line_a>:in `scan'
+    <build-dir>/ruby/test/net/ftp/test_ftp.rb:<line_a>:in `block in test_retrbinary_read_timeout_not_exceeded'
+    <build-dir>/ruby/test/net/ftp/test_ftp.rb:<line_a>:in `block in create_ftp_server'
 
 Finished tests in <n>s, <n> tests/s, <n> assertions/s.
 <num> tests, <num> assertions, <num> failures, <num> errors, <num> skips
 
 ruby -v: ruby <version>
+make: *** [yes-test-all] Error 5
 exit 2
 failed(test-all)
 == rubyspec # <time>
@@ 70969 @@
 - sends an out-of-band messagetimeout: output interval exceeds 600.0 seconds.
 timeout: the process group <pgid> is alive.
 PSOUT  PGID   PID     ELAPSED  %CPU      VSZ COMM             ARGS
+PSOUT 97585 97585       11:05   0.0  2460580 /Applications/Xc /Applications/Xcode.app/Contents/Developer/usr/bin/make MSPECOPT=-Vfs yes-test-rubyspec
+PSOUT 97585 97586       11:04   0.0  2637488 /Users/hsbt/Docu <build-dir>/ruby/spec/mspec/bin/mspec-run
 timeout: INT signal sent.
 make: *** [yes-test-spec] Error 1
 failed(rubyspec CommandTimeout)
@@ 70979 @@
 /Users/hsbt/.anyenv/envs/rbenv/versions/2.5.0/bin/ruby --disable=gems ./tool/make-snapshot \
 	-srcdir=. -packages=gzip,zip,all \
 	-unicode-version=10.0.0 \
+	tmp trunk@64223
 Exporting trunk@<rev>
 Exported revision <rev>.
 copying ./tool/config.guess

===================================================================
--- 20180807T214501Z
@@ 750 @@
 ---
 Configuration summary for ruby version 2.6.0
 
-   * Installation prefix: /Users/hsbt/Documents/cb/tmp/build/20180807T214501\
                           Z
    * exec prefix:         ${prefix}
    * arch:                x86_64-darwin16
@@ 8427 @@
 [n/n] FTPTest#test_read_timeout_not_exceeded = <elapsed> s
 [n/n] FTPTest#test_retrbinary_fail = <elapsed> s
 [n/n] FTPTest#test_retrbinary_read_timeout_exceeded = <elapsed> s
-[n/n] FTPTest#test_retrbinary_read_timeout_not_exceeded = <elapsed> s
 [n/n] FTPTest#test_retrlines = <elapsed> s
 [n/n] FTPTest#test_s_new_timeout_options = <elapsed> s
 [n/n] FTPTest#test_s_open = <elapsed> s
@@ 27845 @@
 [n/n] YAMLStoreTest#test_yaml_store_files_are_accessed_as_binary_files = <elapsed> s
 
  <n>) Failure:
-FTPTest#test_read_timeout_exceeded [<build-dir>/ruby/test/net/ftp/test_ftp.rb:353]:
-Expected /\APASS / to match nil.
 
  <n>) Failure:
 Fiddle::TestFunction#test_nogvl_poll [<build-dir>/ruby/test/fiddle/test_function.rb:89]:
 slept amount of time.
-Expected |200 - 350| (150) to be <= 100.
 
  <n>) Error:
 FTPTest#test_read_timeout_not_exceeded:
@@ 27863 @@
     <build-dir>/ruby/lib/net/ftp.rb:<line_a>:in `getline'
     <build-dir>/ruby/lib/net/ftp.rb:<line_a>:in `getmultiline'
     <build-dir>/ruby/lib/net/ftp.rb:<line_a>:in `getresp'
-    <build-dir>/ruby/lib/net/ftp.rb:<line_a>:in `voidresp'
-    <build-dir>/ruby/lib/net/ftp.rb:<line_a>:in `block in voidcmd'
     <build-dir>/ruby/lib/monitor.rb:<line_a>:in `mon_synchronize'
-    <build-dir>/ruby/lib/net/ftp.rb:<line_a>:in `voidcmd'
-    <build-dir>/ruby/lib/net/ftp.rb:<line_a>:in `send_type_command'
     <build-dir>/ruby/lib/net/ftp.rb:<line_a>:in `login'
     <build-dir>/ruby/test/net/ftp/test_ftp.rb:<line_a>:in `test_read_timeout_not_exceeded'
 
@@ 27875 @@
 <num> tests, <num> assertions, <num> failures, <num> errors, <num> skips
 
 ruby -v: ruby <version>
-make: *** [yes-test-all] Error 3
 exit 2
 failed(test-all)
 == rubyspec # <time>
@@ 70936 @@
 - sends an out-of-band messagetimeout: output interval exceeds 600.0 seconds.
 timeout: the process group <pgid> is alive.
 PSOUT  PGID   PID     ELAPSED  %CPU      VSZ COMM             ARGS
-PSOUT 64160 64160       11:06   0.0  2442148 /Applications/Xc /Applications/Xcode.app/Contents/Developer/usr/bin/make MSPECOPT=-Vfs yes-test-rubyspec
-PSOUT 64160 64161       11:06   0.0  2638512 /Users/hsbt/Docu <build-dir>/ruby/spec/mspec/bin/mspec-run
 timeout: INT signal sent.
 make: *** [yes-test-spec] Error 1
 failed(rubyspec CommandTimeout)
@@ 70946 @@
 /Users/hsbt/.anyenv/envs/rbenv/versions/2.5.0/bin/ruby --disable=gems ./tool/make-snapshot \
 	-srcdir=. -packages=gzip,zip,all \
 	-unicode-version=10.0.0 \
-	tmp trunk@64222
 Exporting trunk@<rev>
 Exported revision <rev>.
 copying ./tool/config.guess

OlderDiff < 20180807T214501Z(failure) < ThisDiff > 20180808T014501Z(failure) > NewerDiff


chkbuild summary recent last