r63014 ruby 2.3.7p456 (2018-03-28) [x86_64-linux] [2.3] (ubuntu) 1003W failed(test-all) 4failed(test/) rubyspec:0F8E

chkbuild summary recent last

OlderDiff < 20180810T103110Z(failure) < ThisDiff > 20180810T133602Z(failure) > NewerDiff

===================================================================
+++ 20180810T133602Z
@@ 151 @@
 Gid:	1003	1003	1003	1003
 FDSize:	64
 Groups:	1003
+NStgid:	3294
+NSpid:	3294
+NSpgid:	3294
+NSsid:	5251
 VmPeak: <nnn> kB
 VmSize: <nnn> kB
 VmLck: <nnn> kB
@@ 162 @@
 VmHWM: <nnn> kB
 VmRSS: <nnn> kB
 RssAnon:	      64 kB
+RssFile:	     720 kB
 RssShmem:	       0 kB
 VmData: <nnn> kB
 VmStk: <nnn> kB
@@ 1952 @@
 internal.h:<line_a>:30: warning: this use of "defined" may not be portable [-Wexpansion-to-defined]
 compiling enc/ascii.c
 compiling enc/us_ascii.c
+/bin/mkdir -p enc/unicode
++ cp enc/unicode/name2ctype.h.blt enc/unicode/name2ctype.h
 compiling enc/unicode.c
 compiling enc/utf_8.c
 generating enc/trans/newline.c ...
@@ 17865 @@
 
  <n>) Error:
 TestRDocRubygemsHook#test_delete_legacy_args:
+RuntimeError: no  in [#<Digest::SHA512: 5bff85e8e469c34f6ca6a7e7c52affbc254ca6095586ab77cdfa37f3ef9c9dc8db105a5450bbf63d754c52910448c43c8d7f1c349359c95a4a8fd270ac08942e>]
     <build-dir>/ruby/lib/rubygems/package/tar_writer.rb:<line_a>:in `add_file_signed'
     <build-dir>/ruby/lib/rubygems/package.rb:<line_a>:in `add_metadata'
     <build-dir>/ruby/lib/rubygems/package.rb:<line_a>:in `block (2 levels) in build'
@@ 17885 @@
 
  <n>) Error:
 TestRDocRubygemsHook#test_generate_configuration_rdoc_array:
+RuntimeError: no  in [#<Digest::SHA512: 5bff85e8e469c34f6ca6a7e7c52affbc254ca6095586ab77cdfa37f3ef9c9dc8db105a5450bbf63d754c52910448c43c8d7f1c349359c95a4a8fd270ac08942e>]
     <build-dir>/ruby/lib/rubygems/package/tar_writer.rb:<line_a>:in `add_file_signed'
     <build-dir>/ruby/lib/rubygems/package.rb:<line_a>:in `add_metadata'
     <build-dir>/ruby/lib/rubygems/package.rb:<line_a>:in `block (2 levels) in build'
@@ 17905 @@
 
  <n>) Error:
 TestRDocRubygemsHook#test_ri_installed?:
+RuntimeError: no  in [#<Digest::SHA512: 5bff85e8e469c34f6ca6a7e7c52affbc254ca6095586ab77cdfa37f3ef9c9dc8db105a5450bbf63d754c52910448c43c8d7f1c349359c95a4a8fd270ac08942e>]
     <build-dir>/ruby/lib/rubygems/package/tar_writer.rb:<line_a>:in `add_file_signed'
     <build-dir>/ruby/lib/rubygems/package.rb:<line_a>:in `add_metadata'
     <build-dir>/ruby/lib/rubygems/package.rb:<line_a>:in `block (2 levels) in build'
@@ 17925 @@
 
  <n>) Error:
 TestRDocRubygemsHook#test_generate_all:
+RuntimeError: no  in [#<Digest::SHA512: 5bff85e8e469c34f6ca6a7e7c52affbc254ca6095586ab77cdfa37f3ef9c9dc8db105a5450bbf63d754c52910448c43c8d7f1c349359c95a4a8fd270ac08942e>]
     <build-dir>/ruby/lib/rubygems/package/tar_writer.rb:<line_a>:in `add_file_signed'
     <build-dir>/ruby/lib/rubygems/package.rb:<line_a>:in `add_metadata'
     <build-dir>/ruby/lib/rubygems/package.rb:<line_a>:in `block (2 levels) in build'
@@ 17945 @@
 
  <n>) Error:
 TestRDocRubygemsHook#test_rdoc_installed?:
+RuntimeError: no  in [#<Digest::SHA512: 5bff85e8e469c34f6ca6a7e7c52affbc254ca6095586ab77cdfa37f3ef9c9dc8db105a5450bbf63d754c52910448c43c8d7f1c349359c95a4a8fd270ac08942e>]
     <build-dir>/ruby/lib/rubygems/package/tar_writer.rb:<line_a>:in `add_file_signed'
     <build-dir>/ruby/lib/rubygems/package.rb:<line_a>:in `add_metadata'
     <build-dir>/ruby/lib/rubygems/package.rb:<line_a>:in `block (2 levels) in build'
@@ 17965 @@
 
  <n>) Error:
 TestRDocRubygemsHook#test_generate_default_gem:
+RuntimeError: no  in [#<Digest::SHA512: 5bff85e8e469c34f6ca6a7e7c52affbc254ca6095586ab77cdfa37f3ef9c9dc8db105a5450bbf63d754c52910448c43c8d7f1c349359c95a4a8fd270ac08942e>]
     <build-dir>/ruby/lib/rubygems/package/tar_writer.rb:<line_a>:in `add_file_signed'
     <build-dir>/ruby/lib/rubygems/package.rb:<line_a>:in `add_metadata'
     <build-dir>/ruby/lib/rubygems/package.rb:<line_a>:in `block (2 levels) in build'
@@ 17985 @@
 
  <n>) Error:
 TestRDocRubygemsHook#test_initialize:
+RuntimeError: no  in [#<Digest::SHA512: 5bff85e8e469c34f6ca6a7e7c52affbc254ca6095586ab77cdfa37f3ef9c9dc8db105a5450bbf63d754c52910448c43c8d7f1c349359c95a4a8fd270ac08942e>]
     <build-dir>/ruby/lib/rubygems/package/tar_writer.rb:<line_a>:in `add_file_signed'
     <build-dir>/ruby/lib/rubygems/package.rb:<line_a>:in `add_metadata'
     <build-dir>/ruby/lib/rubygems/package.rb:<line_a>:in `block (2 levels) in build'
@@ 18005 @@
 
  <n>) Error:
 TestRDocRubygemsHook#test_setup:
+RuntimeError: no  in [#<Digest::SHA512: 5bff85e8e469c34f6ca6a7e7c52affbc254ca6095586ab77cdfa37f3ef9c9dc8db105a5450bbf63d754c52910448c43c8d7f1c349359c95a4a8fd270ac08942e>]
     <build-dir>/ruby/lib/rubygems/package/tar_writer.rb:<line_a>:in `add_file_signed'
     <build-dir>/ruby/lib/rubygems/package.rb:<line_a>:in `add_metadata'
     <build-dir>/ruby/lib/rubygems/package.rb:<line_a>:in `block (2 levels) in build'
@@ 18025 @@
 
  <n>) Error:
 TestRDocRubygemsHook#test_generate_force:
+RuntimeError: no  in [#<Digest::SHA512: 5bff85e8e469c34f6ca6a7e7c52affbc254ca6095586ab77cdfa37f3ef9c9dc8db105a5450bbf63d754c52910448c43c8d7f1c349359c95a4a8fd270ac08942e>]
     <build-dir>/ruby/lib/rubygems/package/tar_writer.rb:<line_a>:in `add_file_signed'
     <build-dir>/ruby/lib/rubygems/package.rb:<line_a>:in `add_metadata'
     <build-dir>/ruby/lib/rubygems/package.rb:<line_a>:in `block (2 levels) in build'
@@ 18045 @@
 
  <n>) Error:
 TestRDocRubygemsHook#test_document:
+RuntimeError: no  in [#<Digest::SHA512: 5bff85e8e469c34f6ca6a7e7c52affbc254ca6095586ab77cdfa37f3ef9c9dc8db105a5450bbf63d754c52910448c43c8d7f1c349359c95a4a8fd270ac08942e>]
     <build-dir>/ruby/lib/rubygems/package/tar_writer.rb:<line_a>:in `add_file_signed'
     <build-dir>/ruby/lib/rubygems/package.rb:<line_a>:in `add_metadata'
     <build-dir>/ruby/lib/rubygems/package.rb:<line_a>:in `block (2 levels) in build'
@@ 18065 @@
 
  <n>) Error:
 TestRDocRubygemsHook#test_generate_configuration_rdoc_string:
+RuntimeError: no  in [#<Digest::SHA512: 5bff85e8e469c34f6ca6a7e7c52affbc254ca6095586ab77cdfa37f3ef9c9dc8db105a5450bbf63d754c52910448c43c8d7f1c349359c95a4a8fd270ac08942e>]
     <build-dir>/ruby/lib/rubygems/package/tar_writer.rb:<line_a>:in `add_file_signed'
     <build-dir>/ruby/lib/rubygems/package.rb:<line_a>:in `add_metadata'
     <build-dir>/ruby/lib/rubygems/package.rb:<line_a>:in `block (2 levels) in build'
@@ 18085 @@
 
  <n>) Error:
 TestRDocRubygemsHook#test_remove_unwritable:
+RuntimeError: no  in [#<Digest::SHA512: 5bff85e8e469c34f6ca6a7e7c52affbc254ca6095586ab77cdfa37f3ef9c9dc8db105a5450bbf63d754c52910448c43c8d7f1c349359c95a4a8fd270ac08942e>]
     <build-dir>/ruby/lib/rubygems/package/tar_writer.rb:<line_a>:in `add_file_signed'
     <build-dir>/ruby/lib/rubygems/package.rb:<line_a>:in `add_metadata'
     <build-dir>/ruby/lib/rubygems/package.rb:<line_a>:in `block (2 levels) in build'
@@ 18105 @@
 
  <n>) Error:
 TestRDocRubygemsHook#test_setup_unwritable:
+RuntimeError: no  in [#<Digest::SHA512: 5bff85e8e469c34f6ca6a7e7c52affbc254ca6095586ab77cdfa37f3ef9c9dc8db105a5450bbf63d754c52910448c43c8d7f1c349359c95a4a8fd270ac08942e>]
     <build-dir>/ruby/lib/rubygems/package/tar_writer.rb:<line_a>:in `add_file_signed'
     <build-dir>/ruby/lib/rubygems/package.rb:<line_a>:in `add_metadata'
     <build-dir>/ruby/lib/rubygems/package.rb:<line_a>:in `block (2 levels) in build'
@@ 18125 @@
 
  <n>) Error:
 TestRDocRubygemsHook#test_generate:
+RuntimeError: no  in [#<Digest::SHA512: 5bff85e8e469c34f6ca6a7e7c52affbc254ca6095586ab77cdfa37f3ef9c9dc8db105a5450bbf63d754c52910448c43c8d7f1c349359c95a4a8fd270ac08942e>]
     <build-dir>/ruby/lib/rubygems/package/tar_writer.rb:<line_a>:in `add_file_signed'
     <build-dir>/ruby/lib/rubygems/package.rb:<line_a>:in `add_metadata'
     <build-dir>/ruby/lib/rubygems/package.rb:<line_a>:in `block (2 levels) in build'
@@ 18145 @@
 
  <n>) Error:
 TestRDocRubygemsHook#test_generate_no_overwrite:
+RuntimeError: no  in [#<Digest::SHA512: 5bff85e8e469c34f6ca6a7e7c52affbc254ca6095586ab77cdfa37f3ef9c9dc8db105a5450bbf63d754c52910448c43c8d7f1c349359c95a4a8fd270ac08942e>]
     <build-dir>/ruby/lib/rubygems/package/tar_writer.rb:<line_a>:in `add_file_signed'
     <build-dir>/ruby/lib/rubygems/package.rb:<line_a>:in `add_metadata'
     <build-dir>/ruby/lib/rubygems/package.rb:<line_a>:in `block (2 levels) in build'
@@ 18165 @@
 
  <n>) Error:
 TestRDocRubygemsHook#test_remove:
+RuntimeError: no  in [#<Digest::SHA512: 5bff85e8e469c34f6ca6a7e7c52affbc254ca6095586ab77cdfa37f3ef9c9dc8db105a5450bbf63d754c52910448c43c8d7f1c349359c95a4a8fd270ac08942e>]
     <build-dir>/ruby/lib/rubygems/package/tar_writer.rb:<line_a>:in `add_file_signed'
     <build-dir>/ruby/lib/rubygems/package.rb:<line_a>:in `add_metadata'
     <build-dir>/ruby/lib/rubygems/package.rb:<line_a>:in `block (2 levels) in build'
@@ 18185 @@
 
  <n>) Error:
 TestRDocRubygemsHook#test_new_rdoc:
+RuntimeError: no  in [#<Digest::SHA512: 5bff85e8e469c34f6ca6a7e7c52affbc254ca6095586ab77cdfa37f3ef9c9dc8db105a5450bbf63d754c52910448c43c8d7f1c349359c95a4a8fd270ac08942e>]
     <build-dir>/ruby/lib/rubygems/package/tar_writer.rb:<line_a>:in `add_file_signed'
     <build-dir>/ruby/lib/rubygems/package.rb:<line_a>:in `add_metadata'
     <build-dir>/ruby/lib/rubygems/package.rb:<line_a>:in `block (2 levels) in build'
@@ 18205 @@
 
  <n>) Error:
 TestRDocRubygemsHook#test_generate_disabled:
+RuntimeError: no  in [#<Digest::SHA512: 5bff85e8e469c34f6ca6a7e7c52affbc254ca6095586ab77cdfa37f3ef9c9dc8db105a5450bbf63d754c52910448c43c8d7f1c349359c95a4a8fd270ac08942e>]
     <build-dir>/ruby/lib/rubygems/package/tar_writer.rb:<line_a>:in `add_file_signed'
     <build-dir>/ruby/lib/rubygems/package.rb:<line_a>:in `add_metadata'
     <build-dir>/ruby/lib/rubygems/package.rb:<line_a>:in `block (2 levels) in build'
@@ 24420 @@
 /* end */
 
 "gcc -o conftest -I../../.ext/include/x86_64-linux -I../.././include -I../.././ext/openssl -DRUBY_DEBUG_ENV    -O3 -fno-fast-math -ggdb3 -Wall -Wextra -Wno-unused-parameter -Wno-parentheses -Wno-long-long -Wno-missing-field-initializers -Wunused-variable -Wpointer-arith -Wwrite-strings -Wdeclaration-after-statement -Wimplicit-function-declaration -Wdeprecated-declarations -Wno-packed-bitfield-compat conftest.c  -L. -L../.. -L. -fstack-protector -rdynamic -Wl,-export-dynamic     -Wl,-rpath,<build-dir>/lib -L<build-dir>/lib -lruby-static -lnsl  -lpthread -ldl -lcrypt -lm   -lc"
+<build-dir>/tmp/ccV3ZIzh.o: In function `t':
 <build-dir>/ruby/ext/openssl/conftest.c:14: undefined reference to `t_open'
 collect2: error: ld returned 1 exit status
 checked program was:
@@ 24544 @@
 /* end */
 
 "gcc -o conftest -I../../.ext/include/x86_64-linux -I../.././include -I../.././ext/openssl -DRUBY_DEBUG_ENV    -O3 -fno-fast-math -ggdb3 -Wall -Wextra -Wno-unused-parameter -Wno-parentheses -Wno-long-long -Wno-missing-field-initializers -Wunused-variable -Wpointer-arith -Wwrite-strings -Wdeclaration-after-statement -Wimplicit-function-declaration -Wdeprecated-declarations -Wno-packed-bitfield-compat conftest.c  -L. -L../.. -L. -fstack-protector -rdynamic -Wl,-export-dynamic     -Wl,-rpath,<build-dir>/lib -L<build-dir>/lib -lruby-static -lcrypto  -lpthread -ldl -lcrypt -lm   -lc"
+<build-dir>/tmp/ccKKPXw1.o: In function `t':
 <build-dir>/ruby/ext/openssl/conftest.c:14: undefined reference to `OpenSSL_add_all_digests'
 collect2: error: ld returned 1 exit status
 checked program was:
@@ 27171 @@
 TestTempfile#test_close_with_unlink_now_true_works = <elapsed> s = .
 TestTempfile#test_concurrency = <elapsed> s = .
 TestTempfile#test_create_traversal_dir = <elapsed> s = .
+Leaked file descriptor: TestTempfile#test_create_traversal_dir: <fd> : #<File:<build-dir>/tmp/..............datachkbuildtmpbuild<buildtime>rubyfoo20180810-6351-14n8fd1>
 TestTempfile#test_create_with_block = <elapsed> s = .
 Closed file descriptor: <test-method>: <fd>
 TestTempfile#test_create_without_block = <elapsed> s = .

===================================================================
--- 20180810T103110Z
@@ 151 @@
 Gid:	1003	1003	1003	1003
 FDSize:	64
 Groups:	1003
-NStgid:	22814
-NSpid:	22814
-NSpgid:	22814
-NSsid:	20291
 VmPeak: <nnn> kB
 VmSize: <nnn> kB
 VmLck: <nnn> kB
@@ 162 @@
 VmHWM: <nnn> kB
 VmRSS: <nnn> kB
 RssAnon:	      64 kB
-RssFile:	     728 kB
 RssShmem:	       0 kB
 VmData: <nnn> kB
 VmStk: <nnn> kB
@@ 17863 @@
 
  <n>) Error:
 TestRDocRubygemsHook#test_generate_configuration_rdoc_string:
-RuntimeError: no  in [#<Digest::SHA512: cf18b32e74d0a4f0e1ac62cf4f05428d4a33fd5c523ab48d88c4d6af80de06b466e6a63f9d32348b6e69ebab87f68387e8bee2c05c9349097a0d1caeece32dcd>]
     <build-dir>/ruby/lib/rubygems/package/tar_writer.rb:<line_a>:in `add_file_signed'
     <build-dir>/ruby/lib/rubygems/package.rb:<line_a>:in `add_metadata'
     <build-dir>/ruby/lib/rubygems/package.rb:<line_a>:in `block (2 levels) in build'
@@ 17883 @@
 
  <n>) Error:
 TestRDocRubygemsHook#test_generate_no_overwrite:
-RuntimeError: no  in [#<Digest::SHA512: cf18b32e74d0a4f0e1ac62cf4f05428d4a33fd5c523ab48d88c4d6af80de06b466e6a63f9d32348b6e69ebab87f68387e8bee2c05c9349097a0d1caeece32dcd>]
     <build-dir>/ruby/lib/rubygems/package/tar_writer.rb:<line_a>:in `add_file_signed'
     <build-dir>/ruby/lib/rubygems/package.rb:<line_a>:in `add_metadata'
     <build-dir>/ruby/lib/rubygems/package.rb:<line_a>:in `block (2 levels) in build'
@@ 17903 @@
 
  <n>) Error:
 TestRDocRubygemsHook#test_generate_all:
-RuntimeError: no  in [#<Digest::SHA512: cf18b32e74d0a4f0e1ac62cf4f05428d4a33fd5c523ab48d88c4d6af80de06b466e6a63f9d32348b6e69ebab87f68387e8bee2c05c9349097a0d1caeece32dcd>]
     <build-dir>/ruby/lib/rubygems/package/tar_writer.rb:<line_a>:in `add_file_signed'
     <build-dir>/ruby/lib/rubygems/package.rb:<line_a>:in `add_metadata'
     <build-dir>/ruby/lib/rubygems/package.rb:<line_a>:in `block (2 levels) in build'
@@ 17923 @@
 
  <n>) Error:
 TestRDocRubygemsHook#test_generate_configuration_rdoc_array:
-RuntimeError: no  in [#<Digest::SHA512: cf18b32e74d0a4f0e1ac62cf4f05428d4a33fd5c523ab48d88c4d6af80de06b466e6a63f9d32348b6e69ebab87f68387e8bee2c05c9349097a0d1caeece32dcd>]
     <build-dir>/ruby/lib/rubygems/package/tar_writer.rb:<line_a>:in `add_file_signed'
     <build-dir>/ruby/lib/rubygems/package.rb:<line_a>:in `add_metadata'
     <build-dir>/ruby/lib/rubygems/package.rb:<line_a>:in `block (2 levels) in build'
@@ 17943 @@
 
  <n>) Error:
 TestRDocRubygemsHook#test_new_rdoc:
-RuntimeError: no  in [#<Digest::SHA512: cf18b32e74d0a4f0e1ac62cf4f05428d4a33fd5c523ab48d88c4d6af80de06b466e6a63f9d32348b6e69ebab87f68387e8bee2c05c9349097a0d1caeece32dcd>]
     <build-dir>/ruby/lib/rubygems/package/tar_writer.rb:<line_a>:in `add_file_signed'
     <build-dir>/ruby/lib/rubygems/package.rb:<line_a>:in `add_metadata'
     <build-dir>/ruby/lib/rubygems/package.rb:<line_a>:in `block (2 levels) in build'
@@ 17963 @@
 
  <n>) Error:
 TestRDocRubygemsHook#test_generate:
-RuntimeError: no  in [#<Digest::SHA512: cf18b32e74d0a4f0e1ac62cf4f05428d4a33fd5c523ab48d88c4d6af80de06b466e6a63f9d32348b6e69ebab87f68387e8bee2c05c9349097a0d1caeece32dcd>]
     <build-dir>/ruby/lib/rubygems/package/tar_writer.rb:<line_a>:in `add_file_signed'
     <build-dir>/ruby/lib/rubygems/package.rb:<line_a>:in `add_metadata'
     <build-dir>/ruby/lib/rubygems/package.rb:<line_a>:in `block (2 levels) in build'
@@ 17983 @@
 
  <n>) Error:
 TestRDocRubygemsHook#test_generate_disabled:
-RuntimeError: no  in [#<Digest::SHA512: cf18b32e74d0a4f0e1ac62cf4f05428d4a33fd5c523ab48d88c4d6af80de06b466e6a63f9d32348b6e69ebab87f68387e8bee2c05c9349097a0d1caeece32dcd>]
     <build-dir>/ruby/lib/rubygems/package/tar_writer.rb:<line_a>:in `add_file_signed'
     <build-dir>/ruby/lib/rubygems/package.rb:<line_a>:in `add_metadata'
     <build-dir>/ruby/lib/rubygems/package.rb:<line_a>:in `block (2 levels) in build'
@@ 18003 @@
 
  <n>) Error:
 TestRDocRubygemsHook#test_ri_installed?:
-RuntimeError: no  in [#<Digest::SHA512: cf18b32e74d0a4f0e1ac62cf4f05428d4a33fd5c523ab48d88c4d6af80de06b466e6a63f9d32348b6e69ebab87f68387e8bee2c05c9349097a0d1caeece32dcd>]
     <build-dir>/ruby/lib/rubygems/package/tar_writer.rb:<line_a>:in `add_file_signed'
     <build-dir>/ruby/lib/rubygems/package.rb:<line_a>:in `add_metadata'
     <build-dir>/ruby/lib/rubygems/package.rb:<line_a>:in `block (2 levels) in build'
@@ 18023 @@
 
  <n>) Error:
 TestRDocRubygemsHook#test_remove:
-RuntimeError: no  in [#<Digest::SHA512: cf18b32e74d0a4f0e1ac62cf4f05428d4a33fd5c523ab48d88c4d6af80de06b466e6a63f9d32348b6e69ebab87f68387e8bee2c05c9349097a0d1caeece32dcd>]
     <build-dir>/ruby/lib/rubygems/package/tar_writer.rb:<line_a>:in `add_file_signed'
     <build-dir>/ruby/lib/rubygems/package.rb:<line_a>:in `add_metadata'
     <build-dir>/ruby/lib/rubygems/package.rb:<line_a>:in `block (2 levels) in build'
@@ 18043 @@
 
  <n>) Error:
 TestRDocRubygemsHook#test_setup_unwritable:
-RuntimeError: no  in [#<Digest::SHA512: cf18b32e74d0a4f0e1ac62cf4f05428d4a33fd5c523ab48d88c4d6af80de06b466e6a63f9d32348b6e69ebab87f68387e8bee2c05c9349097a0d1caeece32dcd>]
     <build-dir>/ruby/lib/rubygems/package/tar_writer.rb:<line_a>:in `add_file_signed'
     <build-dir>/ruby/lib/rubygems/package.rb:<line_a>:in `add_metadata'
     <build-dir>/ruby/lib/rubygems/package.rb:<line_a>:in `block (2 levels) in build'
@@ 18063 @@
 
  <n>) Error:
 TestRDocRubygemsHook#test_delete_legacy_args:
-RuntimeError: no  in [#<Digest::SHA512: cf18b32e74d0a4f0e1ac62cf4f05428d4a33fd5c523ab48d88c4d6af80de06b466e6a63f9d32348b6e69ebab87f68387e8bee2c05c9349097a0d1caeece32dcd>]
     <build-dir>/ruby/lib/rubygems/package/tar_writer.rb:<line_a>:in `add_file_signed'
     <build-dir>/ruby/lib/rubygems/package.rb:<line_a>:in `add_metadata'
     <build-dir>/ruby/lib/rubygems/package.rb:<line_a>:in `block (2 levels) in build'
@@ 18083 @@
 
  <n>) Error:
 TestRDocRubygemsHook#test_document:
-RuntimeError: no  in [#<Digest::SHA512: cf18b32e74d0a4f0e1ac62cf4f05428d4a33fd5c523ab48d88c4d6af80de06b466e6a63f9d32348b6e69ebab87f68387e8bee2c05c9349097a0d1caeece32dcd>]
     <build-dir>/ruby/lib/rubygems/package/tar_writer.rb:<line_a>:in `add_file_signed'
     <build-dir>/ruby/lib/rubygems/package.rb:<line_a>:in `add_metadata'
     <build-dir>/ruby/lib/rubygems/package.rb:<line_a>:in `block (2 levels) in build'
@@ 18103 @@
 
  <n>) Error:
 TestRDocRubygemsHook#test_rdoc_installed?:
-RuntimeError: no  in [#<Digest::SHA512: cf18b32e74d0a4f0e1ac62cf4f05428d4a33fd5c523ab48d88c4d6af80de06b466e6a63f9d32348b6e69ebab87f68387e8bee2c05c9349097a0d1caeece32dcd>]
     <build-dir>/ruby/lib/rubygems/package/tar_writer.rb:<line_a>:in `add_file_signed'
     <build-dir>/ruby/lib/rubygems/package.rb:<line_a>:in `add_metadata'
     <build-dir>/ruby/lib/rubygems/package.rb:<line_a>:in `block (2 levels) in build'
@@ 18123 @@
 
  <n>) Error:
 TestRDocRubygemsHook#test_generate_force:
-RuntimeError: no  in [#<Digest::SHA512: cf18b32e74d0a4f0e1ac62cf4f05428d4a33fd5c523ab48d88c4d6af80de06b466e6a63f9d32348b6e69ebab87f68387e8bee2c05c9349097a0d1caeece32dcd>]
     <build-dir>/ruby/lib/rubygems/package/tar_writer.rb:<line_a>:in `add_file_signed'
     <build-dir>/ruby/lib/rubygems/package.rb:<line_a>:in `add_metadata'
     <build-dir>/ruby/lib/rubygems/package.rb:<line_a>:in `block (2 levels) in build'
@@ 18143 @@
 
  <n>) Error:
 TestRDocRubygemsHook#test_initialize:
-RuntimeError: no  in [#<Digest::SHA512: cf18b32e74d0a4f0e1ac62cf4f05428d4a33fd5c523ab48d88c4d6af80de06b466e6a63f9d32348b6e69ebab87f68387e8bee2c05c9349097a0d1caeece32dcd>]
     <build-dir>/ruby/lib/rubygems/package/tar_writer.rb:<line_a>:in `add_file_signed'
     <build-dir>/ruby/lib/rubygems/package.rb:<line_a>:in `add_metadata'
     <build-dir>/ruby/lib/rubygems/package.rb:<line_a>:in `block (2 levels) in build'
@@ 18163 @@
 
  <n>) Error:
 TestRDocRubygemsHook#test_generate_default_gem:
-RuntimeError: no  in [#<Digest::SHA512: cf18b32e74d0a4f0e1ac62cf4f05428d4a33fd5c523ab48d88c4d6af80de06b466e6a63f9d32348b6e69ebab87f68387e8bee2c05c9349097a0d1caeece32dcd>]
     <build-dir>/ruby/lib/rubygems/package/tar_writer.rb:<line_a>:in `add_file_signed'
     <build-dir>/ruby/lib/rubygems/package.rb:<line_a>:in `add_metadata'
     <build-dir>/ruby/lib/rubygems/package.rb:<line_a>:in `block (2 levels) in build'
@@ 18183 @@
 
  <n>) Error:
 TestRDocRubygemsHook#test_remove_unwritable:
-RuntimeError: no  in [#<Digest::SHA512: cf18b32e74d0a4f0e1ac62cf4f05428d4a33fd5c523ab48d88c4d6af80de06b466e6a63f9d32348b6e69ebab87f68387e8bee2c05c9349097a0d1caeece32dcd>]
     <build-dir>/ruby/lib/rubygems/package/tar_writer.rb:<line_a>:in `add_file_signed'
     <build-dir>/ruby/lib/rubygems/package.rb:<line_a>:in `add_metadata'
     <build-dir>/ruby/lib/rubygems/package.rb:<line_a>:in `block (2 levels) in build'
@@ 18203 @@
 
  <n>) Error:
 TestRDocRubygemsHook#test_setup:
-RuntimeError: no  in [#<Digest::SHA512: cf18b32e74d0a4f0e1ac62cf4f05428d4a33fd5c523ab48d88c4d6af80de06b466e6a63f9d32348b6e69ebab87f68387e8bee2c05c9349097a0d1caeece32dcd>]
     <build-dir>/ruby/lib/rubygems/package/tar_writer.rb:<line_a>:in `add_file_signed'
     <build-dir>/ruby/lib/rubygems/package.rb:<line_a>:in `add_metadata'
     <build-dir>/ruby/lib/rubygems/package.rb:<line_a>:in `block (2 levels) in build'
@@ 24418 @@
 /* end */
 
 "gcc -o conftest -I../../.ext/include/x86_64-linux -I../.././include -I../.././ext/openssl -DRUBY_DEBUG_ENV    -O3 -fno-fast-math -ggdb3 -Wall -Wextra -Wno-unused-parameter -Wno-parentheses -Wno-long-long -Wno-missing-field-initializers -Wunused-variable -Wpointer-arith -Wwrite-strings -Wdeclaration-after-statement -Wimplicit-function-declaration -Wdeprecated-declarations -Wno-packed-bitfield-compat conftest.c  -L. -L../.. -L. -fstack-protector -rdynamic -Wl,-export-dynamic     -Wl,-rpath,<build-dir>/lib -L<build-dir>/lib -lruby-static -lnsl  -lpthread -ldl -lcrypt -lm   -lc"
-<build-dir>/tmp/ccJKvFaC.o: In function `t':
 <build-dir>/ruby/ext/openssl/conftest.c:14: undefined reference to `t_open'
 collect2: error: ld returned 1 exit status
 checked program was:
@@ 24542 @@
 /* end */
 
 "gcc -o conftest -I../../.ext/include/x86_64-linux -I../.././include -I../.././ext/openssl -DRUBY_DEBUG_ENV    -O3 -fno-fast-math -ggdb3 -Wall -Wextra -Wno-unused-parameter -Wno-parentheses -Wno-long-long -Wno-missing-field-initializers -Wunused-variable -Wpointer-arith -Wwrite-strings -Wdeclaration-after-statement -Wimplicit-function-declaration -Wdeprecated-declarations -Wno-packed-bitfield-compat conftest.c  -L. -L../.. -L. -fstack-protector -rdynamic -Wl,-export-dynamic     -Wl,-rpath,<build-dir>/lib -L<build-dir>/lib -lruby-static -lcrypto  -lpthread -ldl -lcrypt -lm   -lc"
-<build-dir>/tmp/ccKUbsCc.o: In function `t':
 <build-dir>/ruby/ext/openssl/conftest.c:14: undefined reference to `OpenSSL_add_all_digests'
 collect2: error: ld returned 1 exit status
 checked program was:
@@ 27169 @@
 TestTempfile#test_close_with_unlink_now_true_works = <elapsed> s = .
 TestTempfile#test_concurrency = <elapsed> s = .
 TestTempfile#test_create_traversal_dir = <elapsed> s = .
-Leaked file descriptor: TestTempfile#test_create_traversal_dir: <fd> : #<File:<build-dir>/tmp/..............datachkbuildtmpbuild<buildtime>rubyfoo20180810-30476-l7rayh>
 TestTempfile#test_create_with_block = <elapsed> s = .
 Closed file descriptor: <test-method>: <fd>
 TestTempfile#test_create_without_block = <elapsed> s = .

OlderDiff < 20180810T103110Z(failure) < ThisDiff > 20180810T133602Z(failure) > NewerDiff


chkbuild summary recent last