r64257 ruby 2.6.0dev (2018-08-09) [sparc-solaris2.10] (unstable10s) 844W failed(test-all CommandTimeout) rubyspec:98F42E

chkbuild summary recent last

20180809T101912Z(failure) < OlderDiff < 20180809T151911Z(failure) > NewerDiff > 20180810T111914Z(failure)

== test-all # 2018-08-09T18:50:57+02:00 (full)
...(snip 11657 lines)...
[11265/19800] TestIseqLoad#test_bug8543 = 0.01 s
[11266/19800] TestIseqLoad#test_case_when = 0.01 s
[11267/19800] TestIseqLoad#test_hidden/export/home/rubyci/unstable10s/tmp/build/20180809T151911Z/ruby/test/-ext-/iseq_load/test_iseq_load.rb:58: warning: assigned but unused variable - b
/export/home/rubyci/unstable10s/tmp/build/20180809T151911Z/ruby/test/-ext-/iseq_load/test_iseq_load.rb:58: warning: assigned but unused variable - c
 = 0.00 s
[11268/19800] TestIseqLoad#test_kwarg = 0.00 s
[11269/19800] TestIseqLoad#test_next_in_block_in_block/export/home/rubyci/unstable10s/tmp/build/20180809T151911Z/ruby/test/-ext-/iseq_load/test_iseq_load.rb:74: warning: statement not reached
 = 0.00 s
[11270/19800] TestIseqLoad#test_require_integration = 0.00 s
[11271/19800] TestIseqLoad#test_splatsplat = 0.00 s
[11272/19800] TestIseqLoad#test_stressful_roundtriptimeout: output interval exceeds 600.0 seconds.
lsof: can't read namelist from /dev/ksyms
timeout: the process group 21983 is alive.
PSOUT  PGID   PID     ELAPSED %CPU  VSZ COMMAND                                                                          COMMAND
PSOUT 21983 22019    01:02:47  3.2 421800 /export/home/rubyci/unstable10s/tmp/build/20180809T151911Z/ruby/ruby             /export/home/rubyci/unstable10s/tmp/build/20180809T151911Z/ruby/ruby --disable-
PSOUT 21983 21983    01:02:48  0.0 3864 gmake                                                                            gmake TESTS=--hide-skip -v RUBYOPT=-w test-all
timeout: INT signal sent.
timeout: INT signal sent.
timeout: TERM signal sent.
timeout: TERM signal sent.
timeout: KILL signal sent.
lsof: can't read namelist from /dev/ksyms
some descendant process in process group 21983 remain.
PSOUT  PGID   PID     ELAPSED %CPU  VSZ COMMAND                                                                          COMMAND
PSOUT 21983 22019           -    -    0 <defunct>                                                                        <defunct>
failed(test-all CommandTimeout)
== rubyspec # 2018-08-09T21:21:43+02:00 (full)
...(snip 49726 lines)...
- breaks a loop
- breaks the inner loop

C-API Util function rb_sourcefile
- returns the current ruby file

C-API Util function rb_sourceline
- returns the current ruby file


1)
Addrinfo.foreach yields Addrinfo instances to the supplied block ERROR
SocketError: getaddrinfo: node name or service name not known
/export/home/rubyci/unstable10s/tmp/build/20180809T151911Z/ruby/.ext/common/socket.rb:227:in `getaddrinfo'
/export/home/rubyci/unstable10s/tmp/build/20180809T151911Z/ruby/.ext/common/socket.rb:227:in `foreach'
/export/home/rubyci/unstable10s/tmp/build/20180809T151911Z/ruby/spec/ruby/library/socket/addrinfo/foreach_spec.rb:5:in `block (2 levels) in <top (required)>'
/export/home/rubyci/unstable10s/tmp/build/20180809T151911Z/ruby/spec/ruby/library/socket/addrinfo/foreach_spec.rb:3:in `<top (required)>'

2)
Addrinfo.getaddrinfo returns an Array of Addrinfo instances ERROR
SocketError: getaddrinfo: node name or service name not known
/export/home/rubyci/unstable10s/tmp/build/20180809T151911Z/ruby/spec/ruby/library/socket/addrinfo/getaddrinfo_spec.rb:6:in `getaddrinfo'
/export/home/rubyci/unstable10s/tmp/build/20180809T151911Z/ruby/spec/ruby/library/socket/addrinfo/getaddrinfo_spec.rb:6:in `block (2 levels) in <top (required)>'
/export/home/rubyci/unstable10s/tmp/build/20180809T151911Z/ruby/spec/ruby/library/socket/addrinfo/getaddrinfo_spec.rb:4:in `<top (required)>'

3)
Addrinfo.getaddrinfo sets the default socket type of the Addrinfo instances ERROR
SocketError: getaddrinfo: node name or service name not known
/export/home/rubyci/unstable10s/tmp/build/20180809T151911Z/ruby/spec/ruby/library/socket/addrinfo/getaddrinfo_spec.rb:54:in `getaddrinfo'
/export/home/rubyci/unstable10s/tmp/build/20180809T151911Z/ruby/spec/ruby/library/socket/addrinfo/getaddrinfo_spec.rb:54:in `block (3 levels) in <top (required)>'
/export/home/rubyci/unstable10s/tmp/build/20180809T151911Z/ruby/spec/ruby/library/socket/addrinfo/getaddrinfo_spec.rb:4:in `<top (required)>'

4)
Addrinfo.getaddrinfo sets the default socket protocol of the Addrinfo instances ERROR
SocketError: getaddrinfo: node name or service name not known
/export/home/rubyci/unstable10s/tmp/build/20180809T151911Z/ruby/spec/ruby/library/socket/addrinfo/getaddrinfo_spec.rb:69:in `getaddrinfo'
/export/home/rubyci/unstable10s/tmp/build/20180809T151911Z/ruby/spec/ruby/library/socket/addrinfo/getaddrinfo_spec.rb:69:in `block (3 levels) in <top (required)>'
/export/home/rubyci/unstable10s/tmp/build/20180809T151911Z/ruby/spec/ruby/library/socket/addrinfo/getaddrinfo_spec.rb:4:in `<top (required)>'

5)
Addrinfo.getaddrinfo sets the canonical name when AI_CANONNAME is given as a flag ERROR
SocketError: getaddrinfo: node name or service name not known
/export/home/rubyci/unstable10s/tmp/build/20180809T151911Z/ruby/spec/ruby/library/socket/addrinfo/getaddrinfo_spec.rb:84:in `getaddrinfo'
/export/home/rubyci/unstable10s/tmp/build/20180809T151911Z/ruby/spec/ruby/library/socket/addrinfo/getaddrinfo_spec.rb:84:in `block (2 levels) in <top (required)>'
/export/home/rubyci/unstable10s/tmp/build/20180809T151911Z/ruby/spec/ruby/library/socket/addrinfo/getaddrinfo_spec.rb:4:in `<top (required)>'

6)
Addrinfo#getnameinfo using an IP Addrinfo using IPv4 returns the node and service names FAILED
Expected "80"
 to equal "http"

/export/home/rubyci/unstable10s/tmp/build/20180809T151911Z/ruby/spec/ruby/library/socket/addrinfo/getnameinfo_spec.rb:15:in `block (4 levels) in <top (required)>'
/export/home/rubyci/unstable10s/tmp/build/20180809T151911Z/ruby/spec/ruby/library/socket/addrinfo/getnameinfo_spec.rb:4:in `<top (required)>'

7)
Addrinfo#getnameinfo using an IP Addrinfo using IPv6 returns the node and service names FAILED
Expected "80"
 to equal "http"

/export/home/rubyci/unstable10s/tmp/build/20180809T151911Z/ruby/spec/ruby/library/socket/addrinfo/getnameinfo_spec.rb:15:in `block (4 levels) in <top (required)>'
/export/home/rubyci/unstable10s/tmp/build/20180809T151911Z/ruby/spec/ruby/library/socket/addrinfo/getnameinfo_spec.rb:4:in `<top (required)>'

8)
Addrinfo#initialize using an Array with extra arguments with the AF_INET address family and an explicit socket protocol and no socket type is given raises SocketError when using IPPROTO_ICMP FAILED
Expected SocketError
but no exception was raised (#<Addrinfo: 127.0.0.1:80 IPPROTO_ICMP (hostname)> was returned)
/export/home/rubyci/unstable10s/tmp/build/20180809T151911Z/ruby/spec/ruby/library/socket/addrinfo/initialize_spec.rb:369:in `block (7 levels) in <top (required)>'
/export/home/rubyci/unstable10s/tmp/build/20180809T151911Z/ruby/spec/ruby/library/socket/addrinfo/initialize_spec.rb:3:in `<top (required)>'

9)
Addrinfo#initialize using an Array with extra arguments with the AF_INET address family and an explicit socket protocol and no socket type is given raises SocketError when using IPPROTO_IGMP FAILED
Expected SocketError
but no exception was raised (#<Addrinfo: 127.0.0.1:80 IPPROTO_IGMP (hostname)> was returned)
/export/home/rubyci/unstable10s/tmp/build/20180809T151911Z/ruby/spec/ruby/library/socket/addrinfo/initialize_spec.rb:369:in `block (7 levels) in <top (required)>'
/export/home/rubyci/unstable10s/tmp/build/20180809T151911Z/ruby/spec/ruby/library/socket/addrinfo/initialize_spec.rb:3:in `<top (required)>'

10)
Addrinfo#initialize using an Array with extra arguments with the AF_INET address family and an explicit socket protocol and no socket type is given raises SocketError when using IPPROTO_GGP FAILED
Expected SocketError
but no exception was raised (#<Addrinfo: 127.0.0.1:80 IPPROTO_GGP (hostname)> was returned)
/export/home/rubyci/unstable10s/tmp/build/20180809T151911Z/ruby/spec/ruby/library/socket/addrinfo/initialize_spec.rb:369:in `block (7 levels) in <top (required)>'
/export/home/rubyci/unstable10s/tmp/build/20180809T151911Z/ruby/spec/ruby/library/socket/addrinfo/initialize_spec.rb:3:in `<top (required)>'

11)
Addrinfo#initialize using an Array with extra arguments with the AF_INET address family and an explicit socket protocol and no socket type is given raises SocketError when using IPPROTO_TCP FAILED
Expected SocketError
but no exception was raised (#<Addrinfo: 127.0.0.1:80 IPPROTO_TCP (hostname)> was returned)
/export/home/rubyci/unstable10s/tmp/build/20180809T151911Z/ruby/spec/ruby/library/socket/addrinfo/initialize_spec.rb:369:in `block (7 levels) in <top (required)>'
/export/home/rubyci/unstable10s/tmp/build/20180809T151911Z/ruby/spec/ruby/library/socket/addrinfo/initialize_spec.rb:3:in `<top (required)>'

12)
Addrinfo#initialize using an Array with extra arguments with the AF_INET address family and an explicit socket protocol and no socket type is given raises SocketError when using IPPROTO_EGP FAILED
Expected SocketError
but no exception was raised (#<Addrinfo: 127.0.0.1:80 IPPROTO_EGP (hostname)> was returned)
/export/home/rubyci/unstable10s/tmp/build/20180809T151911Z/ruby/spec/ruby/library/socket/addrinfo/initialize_spec.rb:369:in `block (7 levels) in <top (required)>'
/export/home/rubyci/unstable10s/tmp/build/20180809T151911Z/ruby/spec/ruby/library/socket/addrinfo/initialize_spec.rb:3:in `<top (required)>'

13)
Addrinfo#initialize using an Array with extra arguments with the AF_INET address family and an explicit socket protocol and no socket type is given raises SocketError when using IPPROTO_PUP FAILED
Expected SocketError
but no exception was raised (#<Addrinfo: 127.0.0.1:80 IPPROTO_PUP (hostname)> was returned)
/export/home/rubyci/unstable10s/tmp/build/20180809T151911Z/ruby/spec/ruby/library/socket/addrinfo/initialize_spec.rb:369:in `block (7 levels) in <top (required)>'
/export/home/rubyci/unstable10s/tmp/build/20180809T151911Z/ruby/spec/ruby/library/socket/addrinfo/initialize_spec.rb:3:in `<top (required)>'

14)
Addrinfo#initialize using an Array with extra arguments with the AF_INET address family and an explicit socket protocol and no socket type is given raises SocketError when using IPPROTO_IDP FAILED
Expected SocketError
but no exception was raised (#<Addrinfo: 127.0.0.1:80 IPPROTO_IDP (hostname)> was returned)
/export/home/rubyci/unstable10s/tmp/build/20180809T151911Z/ruby/spec/ruby/library/socket/addrinfo/initialize_spec.rb:369:in `block (7 levels) in <top (required)>'
/export/home/rubyci/unstable10s/tmp/build/20180809T151911Z/ruby/spec/ruby/library/socket/addrinfo/initialize_spec.rb:3:in `<top (required)>'

15)
Addrinfo#initialize using an Array with extra arguments with the AF_INET address family and an explicit socket protocol and no socket type is given raises SocketError when using IPPROTO_HELLO FAILED
Expected SocketError
but no exception was raised (#<Addrinfo: 127.0.0.1:80 IPPROTO_HELLO (hostname)> was returned)
/export/home/rubyci/unstable10s/tmp/build/20180809T151911Z/ruby/spec/ruby/library/socket/addrinfo/initialize_spec.rb:369:in `block (7 levels) in <top (required)>'
/export/home/rubyci/unstable10s/tmp/build/20180809T151911Z/ruby/spec/ruby/library/socket/addrinfo/initialize_spec.rb:3:in `<top (required)>'

16)
Addrinfo#initialize using an Array with extra arguments with the AF_INET address family and an explicit socket protocol and no socket type is given raises SocketError when using IPPROTO_ND FAILED
Expected SocketError
but no exception was raised (#<Addrinfo: 127.0.0.1:80 IPPROTO_ND (hostname)> was returned)
/export/home/rubyci/unstable10s/tmp/build/20180809T151911Z/ruby/spec/ruby/library/socket/addrinfo/initialize_spec.rb:369:in `block (7 levels) in <top (required)>'
/export/home/rubyci/unstable10s/tmp/build/20180809T151911Z/ruby/spec/ruby/library/socket/addrinfo/initialize_spec.rb:3:in `<top (required)>'

17)
Addrinfo#initialize using an Array with extra arguments with the AF_INET address family and an explicit socket protocol and no socket type is given raises SocketError when using IPPROTO_EON FAILED
Expected SocketError
but no exception was raised (#<Addrinfo: 127.0.0.1:80 IPPROTO_EON (hostname)> was returned)
/export/home/rubyci/unstable10s/tmp/build/20180809T151911Z/ruby/spec/ruby/library/socket/addrinfo/initialize_spec.rb:369:in `block (7 levels) in <top (required)>'
/export/home/rubyci/unstable10s/tmp/build/20180809T151911Z/ruby/spec/ruby/library/socket/addrinfo/initialize_spec.rb:3:in `<top (required)>'

18)
Addrinfo#initialize using an Array with extra arguments with the AF_INET address family and an explicit socket protocol and no socket type is given raises SocketError when using IPPROTO_AH FAILED
Expected SocketError
but no exception was raised (#<Addrinfo: 127.0.0.1:80 IPPROTO_AH (hostname)> was returned)
/export/home/rubyci/unstable10s/tmp/build/20180809T151911Z/ruby/spec/ruby/library/socket/addrinfo/initialize_spec.rb:369:in `block (7 levels) in <top (required)>'
/export/home/rubyci/unstable10s/tmp/build/20180809T151911Z/ruby/spec/ruby/library/socket/addrinfo/initialize_spec.rb:3:in `<top (required)>'

19)
Addrinfo#initialize using an Array with extra arguments with the AF_INET address family and an explicit socket protocol and no socket type is given raises SocketError when using IPPROTO_DSTOPTS FAILED
Expected SocketError
but no exception was raised (#<Addrinfo: 127.0.0.1:80 IPPROTO_DSTOPTS (hostname)> was returned)
/export/home/rubyci/unstable10s/tmp/build/20180809T151911Z/ruby/spec/ruby/library/socket/addrinfo/initialize_spec.rb:369:in `block (7 levels) in <top (required)>'
/export/home/rubyci/unstable10s/tmp/build/20180809T151911Z/ruby/spec/ruby/library/socket/addrinfo/initialize_spec.rb:3:in `<top (required)>'

20)
Addrinfo#initialize using an Array with extra arguments with the AF_INET address family and an explicit socket protocol and no socket type is given raises SocketError when using IPPROTO_ESP FAILED
Expected SocketError
but no exception was raised (#<Addrinfo: 127.0.0.1:80 IPPROTO_ESP (hostname)> was returned)
/export/home/rubyci/unstable10s/tmp/build/20180809T151911Z/ruby/spec/ruby/library/socket/addrinfo/initialize_spec.rb:369:in `block (7 levels) in <top (required)>'
/export/home/rubyci/unstable10s/tmp/build/20180809T151911Z/ruby/spec/ruby/library/socket/addrinfo/initialize_spec.rb:3:in `<top (required)>'

21)
Addrinfo#initialize using an Array with extra arguments with the AF_INET address family and an explicit socket protocol and no socket type is given raises SocketError when using IPPROTO_FRAGMENT FAILED
Expected SocketError
but no exception was raised (#<Addrinfo: 127.0.0.1:80 IPPROTO_FRAGMENT (hostname)> was returned)
/export/home/rubyci/unstable10s/tmp/build/20180809T151911Z/ruby/spec/ruby/library/socket/addrinfo/initialize_spec.rb:369:in `block (7 levels) in <top (required)>'
/export/home/rubyci/unstable10s/tmp/build/20180809T151911Z/ruby/spec/ruby/library/socket/addrinfo/initialize_spec.rb:3:in `<top (required)>'

22)
Addrinfo#initialize using an Array with extra arguments with the AF_INET address family and an explicit socket protocol and no socket type is given raises SocketError when using IPPROTO_ICMPV6 FAILED
Expected SocketError
but no exception was raised (#<Addrinfo: 127.0.0.1:80 IPPROTO_ICMPV6 (hostname)> was returned)
/export/home/rubyci/unstable10s/tmp/build/20180809T151911Z/ruby/spec/ruby/library/socket/addrinfo/initialize_spec.rb:369:in `block (7 levels) in <top (required)>'
/export/home/rubyci/unstable10s/tmp/build/20180809T151911Z/ruby/spec/ruby/library/socket/addrinfo/initialize_spec.rb:3:in `<top (required)>'

23)
Addrinfo#initialize using an Array with extra arguments with the AF_INET address family and an explicit socket protocol and no socket type is given raises SocketError when using IPPROTO_IPV6 FAILED
Expected SocketError
but no exception was raised (#<Addrinfo: 127.0.0.1:80 IPPROTO_IPV6 (hostname)> was returned)
/export/home/rubyci/unstable10s/tmp/build/20180809T151911Z/ruby/spec/ruby/library/socket/addrinfo/initialize_spec.rb:369:in `block (7 levels) in <top (required)>'
/export/home/rubyci/unstable10s/tmp/build/20180809T151911Z/ruby/spec/ruby/library/socket/addrinfo/initialize_spec.rb:3:in `<top (required)>'

24)
Addrinfo#initialize using an Array with extra arguments with the AF_INET address family and an explicit socket protocol and no socket type is given raises SocketError when using IPPROTO_NONE FAILED
Expected SocketError
but no exception was raised (#<Addrinfo: 127.0.0.1:80 IPPROTO_NONE (hostname)> was returned)
/export/home/rubyci/unstable10s/tmp/build/20180809T151911Z/ruby/spec/ruby/library/socket/addrinfo/initialize_spec.rb:369:in `block (7 levels) in <top (required)>'
/export/home/rubyci/unstable10s/tmp/build/20180809T151911Z/ruby/spec/ruby/library/socket/addrinfo/initialize_spec.rb:3:in `<top (required)>'

25)
Addrinfo#initialize using an Array with extra arguments with the AF_INET address family and an explicit socket protocol and no socket type is given raises SocketError when using IPPROTO_ROUTING FAILED
Expected SocketError
but no exception was raised (#<Addrinfo: 127.0.0.1:80 IPPROTO_ROUTING (hostname)> was returned)
/export/home/rubyci/unstable10s/tmp/build/20180809T151911Z/ruby/spec/ruby/library/socket/addrinfo/initialize_spec.rb:369:in `block (7 levels) in <top (required)>'
/export/home/rubyci/unstable10s/tmp/build/20180809T151911Z/ruby/spec/ruby/library/socket/addrinfo/initialize_spec.rb:3:in `<top (required)>'

26)
Addrinfo#initialize using an Array with extra arguments with the AF_INET address family and an explicit socket protocol and no socket type is given raises SocketError when using IPPROTO_RAW FAILED
Expected SocketError
but no exception was raised (#<Addrinfo: 127.0.0.1:80 IPPROTO_RAW (hostname)> was returned)
/export/home/rubyci/unstable10s/tmp/build/20180809T151911Z/ruby/spec/ruby/library/socket/addrinfo/initialize_spec.rb:369:in `block (7 levels) in <top (required)>'
/export/home/rubyci/unstable10s/tmp/build/20180809T151911Z/ruby/spec/ruby/library/socket/addrinfo/initialize_spec.rb:3:in `<top (required)>'

27)
Addrinfo#initialize using an Array with extra arguments with the AF_INET address family and an explicit socket protocol and no socket type is given raises SocketError when using IPPROTO_MAX FAILED
Expected SocketError
but no exception was raised (#<Addrinfo: 127.0.0.1:80 IPPROTO_MAX (hostname)> was returned)
/export/home/rubyci/unstable10s/tmp/build/20180809T151911Z/ruby/spec/ruby/library/socket/addrinfo/initialize_spec.rb:369:in `block (7 levels) in <top (required)>'
/export/home/rubyci/unstable10s/tmp/build/20180809T151911Z/ruby/spec/ruby/library/socket/addrinfo/initialize_spec.rb:3:in `<top (required)>'

28)
Addrinfo#initialize using an Array with extra arguments with the AF_INET address family and an explicit socket protocol and the socket type is set to SOCK_DGRAM raises SocketError when using IPPROTO_ICMP FAILED
Expected SocketError
but no exception was raised (#<Addrinfo: 127.0.0.1:80 SOCK_DGRAM IPPROTO_ICMP (hostname)> was returned)
/export/home/rubyci/unstable10s/tmp/build/20180809T151911Z/ruby/spec/ruby/library/socket/addrinfo/initialize_spec.rb:397:in `block (7 levels) in <top (required)>'
/export/home/rubyci/unstable10s/tmp/build/20180809T151911Z/ruby/spec/ruby/library/socket/addrinfo/initialize_spec.rb:3:in `<top (required)>'

29)
Addrinfo#initialize using an Array with extra arguments with the AF_INET address family and an explicit socket protocol and the socket type is set to SOCK_DGRAM raises SocketError when using IPPROTO_IGMP FAILED
Expected SocketError
but no exception was raised (#<Addrinfo: 127.0.0.1:80 SOCK_DGRAM IPPROTO_IGMP (hostname)> was returned)
/export/home/rubyci/unstable10s/tmp/build/20180809T151911Z/ruby/spec/ruby/library/socket/addrinfo/initialize_spec.rb:397:in `block (7 levels) in <top (required)>'
/export/home/rubyci/unstable10s/tmp/build/20180809T151911Z/ruby/spec/ruby/library/socket/addrinfo/initialize_spec.rb:3:in `<top (required)>'

30)
Addrinfo#initialize using an Array with extra arguments with the AF_INET address family and an explicit socket protocol and the socket type is set to SOCK_DGRAM raises SocketError when using IPPROTO_GGP FAILED
Expected SocketError
but no exception was raised (#<Addrinfo: 127.0.0.1:80 SOCK_DGRAM IPPROTO_GGP (hostname)> was returned)
/export/home/rubyci/unstable10s/tmp/build/20180809T151911Z/ruby/spec/ruby/library/socket/addrinfo/initialize_spec.rb:397:in `block (7 levels) in <top (required)>'
/export/home/rubyci/unstable10s/tmp/build/20180809T151911Z/ruby/spec/ruby/library/socket/addrinfo/initialize_spec.rb:3:in `<top (required)>'

31)
Addrinfo#initialize using an Array with extra arguments with the AF_INET address family and an explicit socket protocol and the socket type is set to SOCK_DGRAM raises SocketError when using IPPROTO_TCP FAILED
Expected SocketError
but no exception was raised (#<Addrinfo: 127.0.0.1:80 SOCK_DGRAM IPPROTO_TCP (hostname)> was returned)
/export/home/rubyci/unstable10s/tmp/build/20180809T151911Z/ruby/spec/ruby/library/socket/addrinfo/initialize_spec.rb:397:in `block (7 levels) in <top (required)>'
/export/home/rubyci/unstable10s/tmp/build/20180809T151911Z/ruby/spec/ruby/library/socket/addrinfo/initialize_spec.rb:3:in `<top (required)>'

32)
Addrinfo#initialize using an Array with extra arguments with the AF_INET address family and an explicit socket protocol and the socket type is set to SOCK_DGRAM raises SocketError when using IPPROTO_EGP FAILED
Expected SocketError
but no exception was raised (#<Addrinfo: 127.0.0.1:80 SOCK_DGRAM IPPROTO_EGP (hostname)> was returned)
/export/home/rubyci/unstable10s/tmp/build/20180809T151911Z/ruby/spec/ruby/library/socket/addrinfo/initialize_spec.rb:397:in `block (7 levels) in <top (required)>'
/export/home/rubyci/unstable10s/tmp/build/20180809T151911Z/ruby/spec/ruby/library/socket/addrinfo/initialize_spec.rb:3:in `<top (required)>'

33)
Addrinfo#initialize using an Array with extra arguments with the AF_INET address family and an explicit socket protocol and the socket type is set to SOCK_DGRAM raises SocketError when using IPPROTO_PUP FAILED
Expected SocketError
but no exception was raised (#<Addrinfo: 127.0.0.1:80 SOCK_DGRAM IPPROTO_PUP (hostname)> was returned)
/export/home/rubyci/unstable10s/tmp/build/20180809T151911Z/ruby/spec/ruby/library/socket/addrinfo/initialize_spec.rb:397:in `block (7 levels) in <top (required)>'
/export/home/rubyci/unstable10s/tmp/build/20180809T151911Z/ruby/spec/ruby/library/socket/addrinfo/initialize_spec.rb:3:in `<top (required)>'

34)
Addrinfo#initialize using an Array with extra arguments with the AF_INET address family and an explicit socket protocol and the socket type is set to SOCK_DGRAM raises SocketError when using IPPROTO_IDP FAILED
Expected SocketError
but no exception was raised (#<Addrinfo: 127.0.0.1:80 SOCK_DGRAM IPPROTO_IDP (hostname)> was returned)
/export/home/rubyci/unstable10s/tmp/build/20180809T151911Z/ruby/spec/ruby/library/socket/addrinfo/initialize_spec.rb:397:in `block (7 levels) in <top (required)>'
/export/home/rubyci/unstable10s/tmp/build/20180809T151911Z/ruby/spec/ruby/library/socket/addrinfo/initialize_spec.rb:3:in `<top (required)>'

35)
Addrinfo#initialize using an Array with extra arguments with the AF_INET address family and an explicit socket protocol and the socket type is set to SOCK_DGRAM raises SocketError when using IPPROTO_HELLO FAILED
Expected SocketError
but no exception was raised (#<Addrinfo: 127.0.0.1:80 SOCK_DGRAM IPPROTO_HELLO (hostname)> was returned)
/export/home/rubyci/unstable10s/tmp/build/20180809T151911Z/ruby/spec/ruby/library/socket/addrinfo/initialize_spec.rb:397:in `block (7 levels) in <top (required)>'
/export/home/rubyci/unstable10s/tmp/build/20180809T151911Z/ruby/spec/ruby/library/socket/addrinfo/initialize_spec.rb:3:in `<top (required)>'

36)
Addrinfo#initialize using an Array with extra arguments with the AF_INET address family and an explicit socket protocol and the socket type is set to SOCK_DGRAM raises SocketError when using IPPROTO_ND FAILED
Expected SocketError
but no exception was raised (#<Addrinfo: 127.0.0.1:80 SOCK_DGRAM IPPROTO_ND (hostname)> was returned)
/export/home/rubyci/unstable10s/tmp/build/20180809T151911Z/ruby/spec/ruby/library/socket/addrinfo/initialize_spec.rb:397:in `block (7 levels) in <top (required)>'
/export/home/rubyci/unstable10s/tmp/build/20180809T151911Z/ruby/spec/ruby/library/socket/addrinfo/initialize_spec.rb:3:in `<top (required)>'

37)
Addrinfo#initialize using an Array with extra arguments with the AF_INET address family and an explicit socket protocol and the socket type is set to SOCK_DGRAM raises SocketError when using IPPROTO_EON FAILED
Expected SocketError
but no exception was raised (#<Addrinfo: 127.0.0.1:80 SOCK_DGRAM IPPROTO_EON (hostname)> was returned)
/export/home/rubyci/unstable10s/tmp/build/20180809T151911Z/ruby/spec/ruby/library/socket/addrinfo/initialize_spec.rb:397:in `block (7 levels) in <top (required)>'
/export/home/rubyci/unstable10s/tmp/build/20180809T151911Z/ruby/spec/ruby/library/socket/addrinfo/initialize_spec.rb:3:in `<top (required)>'

38)
Addrinfo#initialize using an Array with extra arguments with the AF_INET address family and an explicit socket protocol and the socket type is set to SOCK_DGRAM raises SocketError when using IPPROTO_AH FAILED
Expected SocketError
but no exception was raised (#<Addrinfo: 127.0.0.1:80 SOCK_DGRAM IPPROTO_AH (hostname)> was returned)
/export/home/rubyci/unstable10s/tmp/build/20180809T151911Z/ruby/spec/ruby/library/socket/addrinfo/initialize_spec.rb:397:in `block (7 levels) in <top (required)>'
/export/home/rubyci/unstable10s/tmp/build/20180809T151911Z/ruby/spec/ruby/library/socket/addrinfo/initialize_spec.rb:3:in `<top (required)>'

39)
Addrinfo#initialize using an Array with extra arguments with the AF_INET address family and an explicit socket protocol and the socket type is set to SOCK_DGRAM raises SocketError when using IPPROTO_DSTOPTS FAILED
Expected SocketError
but no exception was raised (#<Addrinfo: 127.0.0.1:80 SOCK_DGRAM IPPROTO_DSTOPTS (hostname)> was returned)
/export/home/rubyci/unstable10s/tmp/build/20180809T151911Z/ruby/spec/ruby/library/socket/addrinfo/initialize_spec.rb:397:in `block (7 levels) in <top (required)>'
/export/home/rubyci/unstable10s/tmp/build/20180809T151911Z/ruby/spec/ruby/library/socket/addrinfo/initialize_spec.rb:3:in `<top (required)>'

40)
Addrinfo#initialize using an Array with extra arguments with the AF_INET address family and an explicit socket protocol and the socket type is set to SOCK_DGRAM raises SocketError when using IPPROTO_ESP FAILED
Expected SocketError
but no exception was raised (#<Addrinfo: 127.0.0.1:80 SOCK_DGRAM IPPROTO_ESP (hostname)> was returned)
/export/home/rubyci/unstable10s/tmp/build/20180809T151911Z/ruby/spec/ruby/library/socket/addrinfo/initialize_spec.rb:397:in `block (7 levels) in <top (required)>'
/export/home/rubyci/unstable10s/tmp/build/20180809T151911Z/ruby/spec/ruby/library/socket/addrinfo/initialize_spec.rb:3:in `<top (required)>'

41)
Addrinfo#initialize using an Array with extra arguments with the AF_INET address family and an explicit socket protocol and the socket type is set to SOCK_DGRAM raises SocketError when using IPPROTO_FRAGMENT FAILED
Expected SocketError
but no exception was raised (#<Addrinfo: 127.0.0.1:80 SOCK_DGRAM IPPROTO_FRAGMENT (hostname)> was returned)
/export/home/rubyci/unstable10s/tmp/build/20180809T151911Z/ruby/spec/ruby/library/socket/addrinfo/initialize_spec.rb:397:in `block (7 levels) in <top (required)>'
/export/home/rubyci/unstable10s/tmp/build/20180809T151911Z/ruby/spec/ruby/library/socket/addrinfo/initialize_spec.rb:3:in `<top (required)>'

42)
Addrinfo#initialize using an Array with extra arguments with the AF_INET address family and an explicit socket protocol and the socket type is set to SOCK_DGRAM raises SocketError when using IPPROTO_ICMPV6 FAILED
Expected SocketError
but no exception was raised (#<Addrinfo: 127.0.0.1:80 SOCK_DGRAM IPPROTO_ICMPV6 (hostname)> was returned)
/export/home/rubyci/unstable10s/tmp/build/20180809T151911Z/ruby/spec/ruby/library/socket/addrinfo/initialize_spec.rb:397:in `block (7 levels) in <top (required)>'
/export/home/rubyci/unstable10s/tmp/build/20180809T151911Z/ruby/spec/ruby/library/socket/addrinfo/initialize_spec.rb:3:in `<top (required)>'

43)
Addrinfo#initialize using an Array with extra arguments with the AF_INET address family and an explicit socket protocol and the socket type is set to SOCK_DGRAM raises SocketError when using IPPROTO_IPV6 FAILED
Expected SocketError
but no exception was raised (#<Addrinfo: 127.0.0.1:80 SOCK_DGRAM IPPROTO_IPV6 (hostname)> was returned)
/export/home/rubyci/unstable10s/tmp/build/20180809T151911Z/ruby/spec/ruby/library/socket/addrinfo/initialize_spec.rb:397:in `block (7 levels) in <top (required)>'
/export/home/rubyci/unstable10s/tmp/build/20180809T151911Z/ruby/spec/ruby/library/socket/addrinfo/initialize_spec.rb:3:in `<top (required)>'

44)
Addrinfo#initialize using an Array with extra arguments with the AF_INET address family and an explicit socket protocol and the socket type is set to SOCK_DGRAM raises SocketError when using IPPROTO_NONE FAILED
Expected SocketError
but no exception was raised (#<Addrinfo: 127.0.0.1:80 SOCK_DGRAM IPPROTO_NONE (hostname)> was returned)
/export/home/rubyci/unstable10s/tmp/build/20180809T151911Z/ruby/spec/ruby/library/socket/addrinfo/initialize_spec.rb:397:in `block (7 levels) in <top (required)>'
/export/home/rubyci/unstable10s/tmp/build/20180809T151911Z/ruby/spec/ruby/library/socket/addrinfo/initialize_spec.rb:3:in `<top (required)>'

45)
Addrinfo#initialize using an Array with extra arguments with the AF_INET address family and an explicit socket protocol and the socket type is set to SOCK_DGRAM raises SocketError when using IPPROTO_ROUTING FAILED
Expected SocketError
but no exception was raised (#<Addrinfo: 127.0.0.1:80 SOCK_DGRAM IPPROTO_ROUTING (hostname)> was returned)
/export/home/rubyci/unstable10s/tmp/build/20180809T151911Z/ruby/spec/ruby/library/socket/addrinfo/initialize_spec.rb:397:in `block (7 levels) in <top (required)>'
/export/home/rubyci/unstable10s/tmp/build/20180809T151911Z/ruby/spec/ruby/library/socket/addrinfo/initialize_spec.rb:3:in `<top (required)>'

46)
Addrinfo#initialize using an Array with extra arguments with the AF_INET address family and an explicit socket protocol and the socket type is set to SOCK_DGRAM raises SocketError when using IPPROTO_RAW FAILED
Expected SocketError
but no exception was raised (#<Addrinfo: 127.0.0.1:80 SOCK_DGRAM IPPROTO_RAW (hostname)> was returned)
/export/home/rubyci/unstable10s/tmp/build/20180809T151911Z/ruby/spec/ruby/library/socket/addrinfo/initialize_spec.rb:397:in `block (7 levels) in <top (required)>'
/export/home/rubyci/unstable10s/tmp/build/20180809T151911Z/ruby/spec/ruby/library/socket/addrinfo/initialize_spec.rb:3:in `<top (required)>'

47)
Addrinfo#initialize using an Array with extra arguments with the AF_INET address family and an explicit socket protocol and the socket type is set to SOCK_DGRAM raises SocketError when using IPPROTO_MAX FAILED
Expected SocketError
but no exception was raised (#<Addrinfo: 127.0.0.1:80 SOCK_DGRAM IPPROTO_MAX (hostname)> was returned)
/export/home/rubyci/unstable10s/tmp/build/20180809T151911Z/ruby/spec/ruby/library/socket/addrinfo/initialize_spec.rb:397:in `block (7 levels) in <top (required)>'
/export/home/rubyci/unstable10s/tmp/build/20180809T151911Z/ruby/spec/ruby/library/socket/addrinfo/initialize_spec.rb:3:in `<top (required)>'

48)
Addrinfo#initialize using an Array with extra arguments with the AF_INET address family and an explicit socket protocol and the socket type is set to SOCK_SEQPACKET raises SocketError when using IPPROTO_ICMP FAILED
Expected SocketError
but no exception was raised (#<Addrinfo: 127.0.0.1:80 SOCK_SEQPACKET IPPROTO_ICMP (hostname)> was returned)
/export/home/rubyci/unstable10s/tmp/build/20180809T151911Z/ruby/spec/ruby/library/socket/addrinfo/initialize_spec.rb:472:in `block (7 levels) in <top (required)>'
/export/home/rubyci/unstable10s/tmp/build/20180809T151911Z/ruby/spec/ruby/library/socket/addrinfo/initialize_spec.rb:3:in `<top (required)>'

49)
Addrinfo#initialize using an Array with extra arguments with the AF_INET address family and an explicit socket protocol and the socket type is set to SOCK_SEQPACKET raises SocketError when using IPPROTO_IGMP FAILED
Expected SocketError
but no exception was raised (#<Addrinfo: 127.0.0.1:80 SOCK_SEQPACKET IPPROTO_IGMP (hostname)> was returned)
/export/home/rubyci/unstable10s/tmp/build/20180809T151911Z/ruby/spec/ruby/library/socket/addrinfo/initialize_spec.rb:472:in `block (7 levels) in <top (required)>'
/export/home/rubyci/unstable10s/tmp/build/20180809T151911Z/ruby/spec/ruby/library/socket/addrinfo/initialize_spec.rb:3:in `<top (required)>'

50)
Addrinfo#initialize using an Array with extra arguments with the AF_INET address family and an explicit socket protocol and the socket type is set to SOCK_SEQPACKET raises SocketError when using IPPROTO_GGP FAILED
Expected SocketError
but no exception was raised (#<Addrinfo: 127.0.0.1:80 SOCK_SEQPACKET IPPROTO_GGP (hostname)> was returned)
/export/home/rubyci/unstable10s/tmp/build/20180809T151911Z/ruby/spec/ruby/library/socket/addrinfo/initialize_spec.rb:472:in `block (7 levels) in <top (required)>'
/export/home/rubyci/unstable10s/tmp/build/20180809T151911Z/ruby/spec/ruby/library/socket/addrinfo/initialize_spec.rb:3:in `<top (required)>'

51)
Addrinfo#initialize using an Array with extra arguments with the AF_INET address family and an explicit socket protocol and the socket type is set to SOCK_SEQPACKET raises SocketError when using IPPROTO_TCP FAILED
Expected SocketError
but no exception was raised (#<Addrinfo: 127.0.0.1:80 SOCK_SEQPACKET IPPROTO_TCP (hostname)> was returned)
/export/home/rubyci/unstable10s/tmp/build/20180809T151911Z/ruby/spec/ruby/library/socket/addrinfo/initialize_spec.rb:472:in `block (7 levels) in <top (required)>'
/export/home/rubyci/unstable10s/tmp/build/20180809T151911Z/ruby/spec/ruby/library/socket/addrinfo/initialize_spec.rb:3:in `<top (required)>'

52)
Addrinfo#initialize using an Array with extra arguments with the AF_INET address family and an explicit socket protocol and the socket type is set to SOCK_SEQPACKET raises SocketError when using IPPROTO_EGP FAILED
Expected SocketError
but no exception was raised (#<Addrinfo: 127.0.0.1:80 SOCK_SEQPACKET IPPROTO_EGP (hostname)> was returned)
/export/home/rubyci/unstable10s/tmp/build/20180809T151911Z/ruby/spec/ruby/library/socket/addrinfo/initialize_spec.rb:472:in `block (7 levels) in <top (required)>'
/export/home/rubyci/unstable10s/tmp/build/20180809T151911Z/ruby/spec/ruby/library/socket/addrinfo/initialize_spec.rb:3:in `<top (required)>'

53)
Addrinfo#initialize using an Array with extra arguments with the AF_INET address family and an explicit socket protocol and the socket type is set to SOCK_SEQPACKET raises SocketError when using IPPROTO_PUP FAILED
Expected SocketError
but no exception was raised (#<Addrinfo: 127.0.0.1:80 SOCK_SEQPACKET IPPROTO_PUP (hostname)> was returned)
/export/home/rubyci/unstable10s/tmp/build/20180809T151911Z/ruby/spec/ruby/library/socket/addrinfo/initialize_spec.rb:472:in `block (7 levels) in <top (required)>'
/export/home/rubyci/unstable10s/tmp/build/20180809T151911Z/ruby/spec/ruby/library/socket/addrinfo/initialize_spec.rb:3:in `<top (required)>'

54)
Addrinfo#initialize using an Array with extra arguments with the AF_INET address family and an explicit socket protocol and the socket type is set to SOCK_SEQPACKET raises SocketError when using IPPROTO_UDP FAILED
Expected SocketError
but no exception was raised (#<Addrinfo: 127.0.0.1:80 SOCK_SEQPACKET IPPROTO_UDP (hostname)> was returned)
/export/home/rubyci/unstable10s/tmp/build/20180809T151911Z/ruby/spec/ruby/library/socket/addrinfo/initialize_spec.rb:472:in `block (7 levels) in <top (required)>'
/export/home/rubyci/unstable10s/tmp/build/20180809T151911Z/ruby/spec/ruby/library/socket/addrinfo/initialize_spec.rb:3:in `<top (required)>'

55)
Addrinfo#initialize using an Array with extra arguments with the AF_INET address family and an explicit socket protocol and the socket type is set to SOCK_SEQPACKET raises SocketError when using IPPROTO_IDP FAILED
Expected SocketError
but no exception was raised (#<Addrinfo: 127.0.0.1:80 SOCK_SEQPACKET IPPROTO_IDP (hostname)> was returned)
/export/home/rubyci/unstable10s/tmp/build/20180809T151911Z/ruby/spec/ruby/library/socket/addrinfo/initialize_spec.rb:472:in `block (7 levels) in <top (required)>'
/export/home/rubyci/unstable10s/tmp/build/20180809T151911Z/ruby/spec/ruby/library/socket/addrinfo/initialize_spec.rb:3:in `<top (required)>'

56)
Addrinfo#initialize using an Array with extra arguments with the AF_INET address family and an explicit socket protocol and the socket type is set to SOCK_SEQPACKET raises SocketError when using IPPROTO_HELLO FAILED
Expected SocketError
but no exception was raised (#<Addrinfo: 127.0.0.1:80 SOCK_SEQPACKET IPPROTO_HELLO (hostname)> was returned)
/export/home/rubyci/unstable10s/tmp/build/20180809T151911Z/ruby/spec/ruby/library/socket/addrinfo/initialize_spec.rb:472:in `block (7 levels) in <top (required)>'
/export/home/rubyci/unstable10s/tmp/build/20180809T151911Z/ruby/spec/ruby/library/socket/addrinfo/initialize_spec.rb:3:in `<top (required)>'

57)
Addrinfo#initialize using an Array with extra arguments with the AF_INET address family and an explicit socket protocol and the socket type is set to SOCK_SEQPACKET raises SocketError when using IPPROTO_ND FAILED
Expected SocketError
but no exception was raised (#<Addrinfo: 127.0.0.1:80 SOCK_SEQPACKET IPPROTO_ND (hostname)> was returned)
/export/home/rubyci/unstable10s/tmp/build/20180809T151911Z/ruby/spec/ruby/library/socket/addrinfo/initialize_spec.rb:472:in `block (7 levels) in <top (required)>'
/export/home/rubyci/unstable10s/tmp/build/20180809T151911Z/ruby/spec/ruby/library/socket/addrinfo/initialize_spec.rb:3:in `<top (required)>'

58)
Addrinfo#initialize using an Array with extra arguments with the AF_INET address family and an explicit socket protocol and the socket type is set to SOCK_SEQPACKET raises SocketError when using IPPROTO_EON FAILED
Expected SocketError
but no exception was raised (#<Addrinfo: 127.0.0.1:80 SOCK_SEQPACKET IPPROTO_EON (hostname)> was returned)
/export/home/rubyci/unstable10s/tmp/build/20180809T151911Z/ruby/spec/ruby/library/socket/addrinfo/initialize_spec.rb:472:in `block (7 levels) in <top (required)>'
/export/home/rubyci/unstable10s/tmp/build/20180809T151911Z/ruby/spec/ruby/library/socket/addrinfo/initialize_spec.rb:3:in `<top (required)>'

59)
Addrinfo#initialize using an Array with extra arguments with the AF_INET address family and an explicit socket protocol and the socket type is set to SOCK_SEQPACKET raises SocketError when using IPPROTO_AH FAILED
Expected SocketError
but no exception was raised (#<Addrinfo: 127.0.0.1:80 SOCK_SEQPACKET IPPROTO_AH (hostname)> was returned)
/export/home/rubyci/unstable10s/tmp/build/20180809T151911Z/ruby/spec/ruby/library/socket/addrinfo/initialize_spec.rb:472:in `block (7 levels) in <top (required)>'
/export/home/rubyci/unstable10s/tmp/build/20180809T151911Z/ruby/spec/ruby/library/socket/addrinfo/initialize_spec.rb:3:in `<top (required)>'

60)
Addrinfo#initialize using an Array with extra arguments with the AF_INET address family and an explicit socket protocol and the socket type is set to SOCK_SEQPACKET raises SocketError when using IPPROTO_DSTOPTS FAILED
Expected SocketError
but no exception was raised (#<Addrinfo: 127.0.0.1:80 SOCK_SEQPACKET IPPROTO_DSTOPTS (hostname)> was returned)
/export/home/rubyci/unstable10s/tmp/build/20180809T151911Z/ruby/spec/ruby/library/socket/addrinfo/initialize_spec.rb:472:in `block (7 levels) in <top (required)>'
/export/home/rubyci/unstable10s/tmp/build/20180809T151911Z/ruby/spec/ruby/library/socket/addrinfo/initialize_spec.rb:3:in `<top (required)>'

61)
Addrinfo#initialize using an Array with extra arguments with the AF_INET address family and an explicit socket protocol and the socket type is set to SOCK_SEQPACKET raises SocketError when using IPPROTO_ESP FAILED
Expected SocketError
but no exception was raised (#<Addrinfo: 127.0.0.1:80 SOCK_SEQPACKET IPPROTO_ESP (hostname)> was returned)
/export/home/rubyci/unstable10s/tmp/build/20180809T151911Z/ruby/spec/ruby/library/socket/addrinfo/initialize_spec.rb:472:in `block (7 levels) in <top (required)>'
/export/home/rubyci/unstable10s/tmp/build/20180809T151911Z/ruby/spec/ruby/library/socket/addrinfo/initialize_spec.rb:3:in `<top (required)>'

62)
Addrinfo#initialize using an Array with extra arguments with the AF_INET address family and an explicit socket protocol and the socket type is set to SOCK_SEQPACKET raises SocketError when using IPPROTO_FRAGMENT FAILED
Expected SocketError
but no exception was raised (#<Addrinfo: 127.0.0.1:80 SOCK_SEQPACKET IPPROTO_FRAGMENT (hostname)> was returned)
/export/home/rubyci/unstable10s/tmp/build/20180809T151911Z/ruby/spec/ruby/library/socket/addrinfo/initialize_spec.rb:472:in `block (7 levels) in <top (required)>'
/export/home/rubyci/unstable10s/tmp/build/20180809T151911Z/ruby/spec/ruby/library/socket/addrinfo/initialize_spec.rb:3:in `<top (required)>'

63)
Addrinfo#initialize using an Array with extra arguments with the AF_INET address family and an explicit socket protocol and the socket type is set to SOCK_SEQPACKET raises SocketError when using IPPROTO_ICMPV6 FAILED
Expected SocketError
but no exception was raised (#<Addrinfo: 127.0.0.1:80 SOCK_SEQPACKET IPPROTO_ICMPV6 (hostname)> was returned)
/export/home/rubyci/unstable10s/tmp/build/20180809T151911Z/ruby/spec/ruby/library/socket/addrinfo/initialize_spec.rb:472:in `block (7 levels) in <top (required)>'
/export/home/rubyci/unstable10s/tmp/build/20180809T151911Z/ruby/spec/ruby/library/socket/addrinfo/initialize_spec.rb:3:in `<top (required)>'

64)
Addrinfo#initialize using an Array with extra arguments with the AF_INET address family and an explicit socket protocol and the socket type is set to SOCK_SEQPACKET raises SocketError when using IPPROTO_IPV6 FAILED
Expected SocketError
but no exception was raised (#<Addrinfo: 127.0.0.1:80 SOCK_SEQPACKET IPPROTO_IPV6 (hostname)> was returned)
/export/home/rubyci/unstable10s/tmp/build/20180809T151911Z/ruby/spec/ruby/library/socket/addrinfo/initialize_spec.rb:472:in `block (7 levels) in <top (required)>'
/export/home/rubyci/unstable10s/tmp/build/20180809T151911Z/ruby/spec/ruby/library/socket/addrinfo/initialize_spec.rb:3:in `<top (required)>'

65)
Addrinfo#initialize using an Array with extra arguments with the AF_INET address family and an explicit socket protocol and the socket type is set to SOCK_SEQPACKET raises SocketError when using IPPROTO_NONE FAILED
Expected SocketError
but no exception was raised (#<Addrinfo: 127.0.0.1:80 SOCK_SEQPACKET IPPROTO_NONE (hostname)> was returned)
/export/home/rubyci/unstable10s/tmp/build/20180809T151911Z/ruby/spec/ruby/library/socket/addrinfo/initialize_spec.rb:472:in `block (7 levels) in <top (required)>'
/export/home/rubyci/unstable10s/tmp/build/20180809T151911Z/ruby/spec/ruby/library/socket/addrinfo/initialize_spec.rb:3:in `<top (required)>'

66)
Addrinfo#initialize using an Array with extra arguments with the AF_INET address family and an explicit socket protocol and the socket type is set to SOCK_SEQPACKET raises SocketError when using IPPROTO_ROUTING FAILED
Expected SocketError
but no exception was raised (#<Addrinfo: 127.0.0.1:80 SOCK_SEQPACKET IPPROTO_ROUTING (hostname)> was returned)
/export/home/rubyci/unstable10s/tmp/build/20180809T151911Z/ruby/spec/ruby/library/socket/addrinfo/initialize_spec.rb:472:in `block (7 levels) in <top (required)>'
/export/home/rubyci/unstable10s/tmp/build/20180809T151911Z/ruby/spec/ruby/library/socket/addrinfo/initialize_spec.rb:3:in `<top (required)>'

67)
Addrinfo#initialize using an Array with extra arguments with the AF_INET address family and an explicit socket protocol and the socket type is set to SOCK_SEQPACKET raises SocketError when using IPPROTO_RAW FAILED
Expected SocketError
but no exception was raised (#<Addrinfo: 127.0.0.1:80 SOCK_SEQPACKET IPPROTO_RAW (hostname)> was returned)
/export/home/rubyci/unstable10s/tmp/build/20180809T151911Z/ruby/spec/ruby/library/socket/addrinfo/initialize_spec.rb:472:in `block (7 levels) in <top (required)>'
/export/home/rubyci/unstable10s/tmp/build/20180809T151911Z/ruby/spec/ruby/library/socket/addrinfo/initialize_spec.rb:3:in `<top (required)>'

68)
Addrinfo#initialize using an Array with extra arguments with the AF_INET address family and an explicit socket protocol and the socket type is set to SOCK_SEQPACKET raises SocketError when using IPPROTO_MAX FAILED
Expected SocketError
but no exception was raised (#<Addrinfo: 127.0.0.1:80 SOCK_SEQPACKET IPPROTO_MAX (hostname)> was returned)
/export/home/rubyci/unstable10s/tmp/build/20180809T151911Z/ruby/spec/ruby/library/socket/addrinfo/initialize_spec.rb:472:in `block (7 levels) in <top (required)>'
/export/home/rubyci/unstable10s/tmp/build/20180809T151911Z/ruby/spec/ruby/library/socket/addrinfo/initialize_spec.rb:3:in `<top (required)>'

69)
Addrinfo#initialize using an Array with extra arguments with the AF_INET address family and an explicit socket protocol and the socket type is set to SOCK_STREAM raises SocketError when using IPPROTO_ICMP FAILED
Expected SocketError
but no exception was raised (#<Addrinfo: 127.0.0.1:80 SOCK_STREAM IPPROTO_ICMP (hostname)> was returned)
/export/home/rubyci/unstable10s/tmp/build/20180809T151911Z/ruby/spec/ruby/library/socket/addrinfo/initialize_spec.rb:500:in `block (7 levels) in <top (required)>'
/export/home/rubyci/unstable10s/tmp/build/20180809T151911Z/ruby/spec/ruby/library/socket/addrinfo/initialize_spec.rb:3:in `<top (required)>'

70)
Addrinfo#initialize using an Array with extra arguments with the AF_INET address family and an explicit socket protocol and the socket type is set to SOCK_STREAM raises SocketError when using IPPROTO_IGMP FAILED
Expected SocketError
but no exception was raised (#<Addrinfo: 127.0.0.1:80 SOCK_STREAM IPPROTO_IGMP (hostname)> was returned)
/export/home/rubyci/unstable10s/tmp/build/20180809T151911Z/ruby/spec/ruby/library/socket/addrinfo/initialize_spec.rb:500:in `block (7 levels) in <top (required)>'
/export/home/rubyci/unstable10s/tmp/build/20180809T151911Z/ruby/spec/ruby/library/socket/addrinfo/initialize_spec.rb:3:in `<top (required)>'

71)
Addrinfo#initialize using an Array with extra arguments with the AF_INET address family and an explicit socket protocol and the socket type is set to SOCK_STREAM raises SocketError when using IPPROTO_GGP FAILED
Expected SocketError
but no exception was raised (#<Addrinfo: 127.0.0.1:80 SOCK_STREAM IPPROTO_GGP (hostname)> was returned)
/export/home/rubyci/unstable10s/tmp/build/20180809T151911Z/ruby/spec/ruby/library/socket/addrinfo/initialize_spec.rb:500:in `block (7 levels) in <top (required)>'
/export/home/rubyci/unstable10s/tmp/build/20180809T151911Z/ruby/spec/ruby/library/socket/addrinfo/initialize_spec.rb:3:in `<top (required)>'

72)
Addrinfo#initialize using an Array with extra arguments with the AF_INET address family and an explicit socket protocol and the socket type is set to SOCK_STREAM raises SocketError when using IPPROTO_EGP FAILED
Expected SocketError
but no exception was raised (#<Addrinfo: 127.0.0.1:80 SOCK_STREAM IPPROTO_EGP (hostname)> was returned)
/export/home/rubyci/unstable10s/tmp/build/20180809T151911Z/ruby/spec/ruby/library/socket/addrinfo/initialize_spec.rb:500:in `block (7 levels) in <top (required)>'
/export/home/rubyci/unstable10s/tmp/build/20180809T151911Z/ruby/spec/ruby/library/socket/addrinfo/initialize_spec.rb:3:in `<top (required)>'

73)
Addrinfo#initialize using an Array with extra arguments with the AF_INET address family and an explicit socket protocol and the socket type is set to SOCK_STREAM raises SocketError when using IPPROTO_PUP FAILED
Expected SocketError
but no exception was raised (#<Addrinfo: 127.0.0.1:80 SOCK_STREAM IPPROTO_PUP (hostname)> was returned)
/export/home/rubyci/unstable10s/tmp/build/20180809T151911Z/ruby/spec/ruby/library/socket/addrinfo/initialize_spec.rb:500:in `block (7 levels) in <top (required)>'
/export/home/rubyci/unstable10s/tmp/build/20180809T151911Z/ruby/spec/ruby/library/socket/addrinfo/initialize_spec.rb:3:in `<top (required)>'

74)
Addrinfo#initialize using an Array with extra arguments with the AF_INET address family and an explicit socket protocol and the socket type is set to SOCK_STREAM raises SocketError when using IPPROTO_UDP FAILED
Expected SocketError
but no exception was raised (#<Addrinfo: 127.0.0.1:80 SOCK_STREAM IPPROTO_UDP (hostname)> was returned)
/export/home/rubyci/unstable10s/tmp/build/20180809T151911Z/ruby/spec/ruby/library/socket/addrinfo/initialize_spec.rb:500:in `block (7 levels) in <top (required)>'
/export/home/rubyci/unstable10s/tmp/build/20180809T151911Z/ruby/spec/ruby/library/socket/addrinfo/initialize_spec.rb:3:in `<top (required)>'

75)
Addrinfo#initialize using an Array with extra arguments with the AF_INET address family and an explicit socket protocol and the socket type is set to SOCK_STREAM raises SocketError when using IPPROTO_IDP FAILED
Expected SocketError
but no exception was raised (#<Addrinfo: 127.0.0.1:80 SOCK_STREAM IPPROTO_IDP (hostname)> was returned)
/export/home/rubyci/unstable10s/tmp/build/20180809T151911Z/ruby/spec/ruby/library/socket/addrinfo/initialize_spec.rb:500:in `block (7 levels) in <top (required)>'
/export/home/rubyci/unstable10s/tmp/build/20180809T151911Z/ruby/spec/ruby/library/socket/addrinfo/initialize_spec.rb:3:in `<top (required)>'

76)
Addrinfo#initialize using an Array with extra arguments with the AF_INET address family and an explicit socket protocol and the socket type is set to SOCK_STREAM raises SocketError when using IPPROTO_HELLO FAILED
Expected SocketError
but no exception was raised (#<Addrinfo: 127.0.0.1:80 SOCK_STREAM IPPROTO_HELLO (hostname)> was returned)
/export/home/rubyci/unstable10s/tmp/build/20180809T151911Z/ruby/spec/ruby/library/socket/addrinfo/initialize_spec.rb:500:in `block (7 levels) in <top (required)>'
/export/home/rubyci/unstable10s/tmp/build/20180809T151911Z/ruby/spec/ruby/library/socket/addrinfo/initialize_spec.rb:3:in `<top (required)>'

77)
Addrinfo#initialize using an Array with extra arguments with the AF_INET address family and an explicit socket protocol and the socket type is set to SOCK_STREAM raises SocketError when using IPPROTO_ND FAILED
Expected SocketError
but no exception was raised (#<Addrinfo: 127.0.0.1:80 SOCK_STREAM IPPROTO_ND (hostname)> was returned)
/export/home/rubyci/unstable10s/tmp/build/20180809T151911Z/ruby/spec/ruby/library/socket/addrinfo/initialize_spec.rb:500:in `block (7 levels) in <top (required)>'
/export/home/rubyci/unstable10s/tmp/build/20180809T151911Z/ruby/spec/ruby/library/socket/addrinfo/initialize_spec.rb:3:in `<top (required)>'

78)
Addrinfo#initialize using an Array with extra arguments with the AF_INET address family and an explicit socket protocol and the socket type is set to SOCK_STREAM raises SocketError when using IPPROTO_EON FAILED
Expected SocketError
but no exception was raised (#<Addrinfo: 127.0.0.1:80 SOCK_STREAM IPPROTO_EON (hostname)> was returned)
/export/home/rubyci/unstable10s/tmp/build/20180809T151911Z/ruby/spec/ruby/library/socket/addrinfo/initialize_spec.rb:500:in `block (7 levels) in <top (required)>'
/export/home/rubyci/unstable10s/tmp/build/20180809T151911Z/ruby/spec/ruby/library/socket/addrinfo/initialize_spec.rb:3:in `<top (required)>'

79)
Addrinfo#initialize using an Array with extra arguments with the AF_INET address family and an explicit socket protocol and the socket type is set to SOCK_STREAM raises SocketError when using IPPROTO_AH FAILED
Expected SocketError
but no exception was raised (#<Addrinfo: 127.0.0.1:80 SOCK_STREAM IPPROTO_AH (hostname)> was returned)
/export/home/rubyci/unstable10s/tmp/build/20180809T151911Z/ruby/spec/ruby/library/socket/addrinfo/initialize_spec.rb:500:in `block (7 levels) in <top (required)>'
/export/home/rubyci/unstable10s/tmp/build/20180809T151911Z/ruby/spec/ruby/library/socket/addrinfo/initialize_spec.rb:3:in `<top (required)>'

80)
Addrinfo#initialize using an Array with extra arguments with the AF_INET address family and an explicit socket protocol and the socket type is set to SOCK_STREAM raises SocketError when using IPPROTO_DSTOPTS FAILED
Expected SocketError
but no exception was raised (#<Addrinfo: 127.0.0.1:80 SOCK_STREAM IPPROTO_DSTOPTS (hostname)> was returned)
/export/home/rubyci/unstable10s/tmp/build/20180809T151911Z/ruby/spec/ruby/library/socket/addrinfo/initialize_spec.rb:500:in `block (7 levels) in <top (required)>'
/export/home/rubyci/unstable10s/tmp/build/20180809T151911Z/ruby/spec/ruby/library/socket/addrinfo/initialize_spec.rb:3:in `<top (required)>'

81)
Addrinfo#initialize using an Array with extra arguments with the AF_INET address family and an explicit socket protocol and the socket type is set to SOCK_STREAM raises SocketError when using IPPROTO_ESP FAILED
Expected SocketError
but no exception was raised (#<Addrinfo: 127.0.0.1:80 SOCK_STREAM IPPROTO_ESP (hostname)> was returned)
/export/home/rubyci/unstable10s/tmp/build/20180809T151911Z/ruby/spec/ruby/library/socket/addrinfo/initialize_spec.rb:500:in `block (7 levels) in <top (required)>'
/export/home/rubyci/unstable10s/tmp/build/20180809T151911Z/ruby/spec/ruby/library/socket/addrinfo/initialize_spec.rb:3:in `<top (required)>'

82)
Addrinfo#initialize using an Array with extra arguments with the AF_INET address family and an explicit socket protocol and the socket type is set to SOCK_STREAM raises SocketError when using IPPROTO_FRAGMENT FAILED
Expected SocketError
but no exception was raised (#<Addrinfo: 127.0.0.1:80 SOCK_STREAM IPPROTO_FRAGMENT (hostname)> was returned)
/export/home/rubyci/unstable10s/tmp/build/20180809T151911Z/ruby/spec/ruby/library/socket/addrinfo/initialize_spec.rb:500:in `block (7 levels) in <top (required)>'
/export/home/rubyci/unstable10s/tmp/build/20180809T151911Z/ruby/spec/ruby/library/socket/addrinfo/initialize_spec.rb:3:in `<top (required)>'

83)
Addrinfo#initialize using an Array with extra arguments with the AF_INET address family and an explicit socket protocol and the socket type is set to SOCK_STREAM raises SocketError when using IPPROTO_ICMPV6 FAILED
Expected SocketError
but no exception was raised (#<Addrinfo: 127.0.0.1:80 SOCK_STREAM IPPROTO_ICMPV6 (hostname)> was returned)
/export/home/rubyci/unstable10s/tmp/build/20180809T151911Z/ruby/spec/ruby/library/socket/addrinfo/initialize_spec.rb:500:in `block (7 levels) in <top (required)>'
/export/home/rubyci/unstable10s/tmp/build/20180809T151911Z/ruby/spec/ruby/library/socket/addrinfo/initialize_spec.rb:3:in `<top (required)>'

84)
Addrinfo#initialize using an Array with extra arguments with the AF_INET address family and an explicit socket protocol and the socket type is set to SOCK_STREAM raises SocketError when using IPPROTO_IPV6 FAILED
Expected SocketError
but no exception was raised (#<Addrinfo: 127.0.0.1:80 SOCK_STREAM IPPROTO_IPV6 (hostname)> was returned)
/export/home/rubyci/unstable10s/tmp/build/20180809T151911Z/ruby/spec/ruby/library/socket/addrinfo/initialize_spec.rb:500:in `block (7 levels) in <top (required)>'
/export/home/rubyci/unstable10s/tmp/build/20180809T151911Z/ruby/spec/ruby/library/socket/addrinfo/initialize_spec.rb:3:in `<top (required)>'

85)
Addrinfo#initialize using an Array with extra arguments with the AF_INET address family and an explicit socket protocol and the socket type is set to SOCK_STREAM raises SocketError when using IPPROTO_NONE FAILED
Expected SocketError
but no exception was raised (#<Addrinfo: 127.0.0.1:80 SOCK_STREAM IPPROTO_NONE (hostname)> was returned)
/export/home/rubyci/unstable10s/tmp/build/20180809T151911Z/ruby/spec/ruby/library/socket/addrinfo/initialize_spec.rb:500:in `block (7 levels) in <top (required)>'
/export/home/rubyci/unstable10s/tmp/build/20180809T151911Z/ruby/spec/ruby/library/socket/addrinfo/initialize_spec.rb:3:in `<top (required)>'

86)
Addrinfo#initialize using an Array with extra arguments with the AF_INET address family and an explicit socket protocol and the socket type is set to SOCK_STREAM raises SocketError when using IPPROTO_ROUTING FAILED
Expected SocketError
but no exception was raised (#<Addrinfo: 127.0.0.1:80 SOCK_STREAM IPPROTO_ROUTING (hostname)> was returned)
/export/home/rubyci/unstable10s/tmp/build/20180809T151911Z/ruby/spec/ruby/library/socket/addrinfo/initialize_spec.rb:500:in `block (7 levels) in <top (required)>'
/export/home/rubyci/unstable10s/tmp/build/20180809T151911Z/ruby/spec/ruby/library/socket/addrinfo/initialize_spec.rb:3:in `<top (required)>'

87)
Addrinfo#initialize using an Array with extra arguments with the AF_INET address family and an explicit socket protocol and the socket type is set to SOCK_STREAM raises SocketError when using IPPROTO_RAW FAILED
Expected SocketError
but no exception was raised (#<Addrinfo: 127.0.0.1:80 SOCK_STREAM IPPROTO_RAW (hostname)> was returned)
/export/home/rubyci/unstable10s/tmp/build/20180809T151911Z/ruby/spec/ruby/library/socket/addrinfo/initialize_spec.rb:500:in `block (7 levels) in <top (required)>'
/export/home/rubyci/unstable10s/tmp/build/20180809T151911Z/ruby/spec/ruby/library/socket/addrinfo/initialize_spec.rb:3:in `<top (required)>'

88)
Addrinfo#initialize using an Array with extra arguments with the AF_INET address family and an explicit socket protocol and the socket type is set to SOCK_STREAM raises SocketError when using IPPROTO_MAX FAILED
Expected SocketError
but no exception was raised (#<Addrinfo: 127.0.0.1:80 SOCK_STREAM IPPROTO_MAX (hostname)> was returned)
/export/home/rubyci/unstable10s/tmp/build/20180809T151911Z/ruby/spec/ruby/library/socket/addrinfo/initialize_spec.rb:500:in `block (7 levels) in <top (required)>'
/export/home/rubyci/unstable10s/tmp/build/20180809T151911Z/ruby/spec/ruby/library/socket/addrinfo/initialize_spec.rb:3:in `<top (required)>'

89)
Socket::AncillaryData#initialize using :AF_INET as the family and :SOCKET as the level sets the type to SCM_TIMESTAMP when using :TIMESTAMP as the type argument ERROR
SocketError: unknown UNIX control message: TIMESTAMP
/export/home/rubyci/unstable10s/tmp/build/20180809T151911Z/ruby/spec/ruby/library/socket/ancillarydata/initialize_spec.rb:110:in `initialize'
/export/home/rubyci/unstable10s/tmp/build/20180809T151911Z/ruby/spec/ruby/library/socket/ancillarydata/initialize_spec.rb:110:in `new'
/export/home/rubyci/unstable10s/tmp/build/20180809T151911Z/ruby/spec/ruby/library/socket/ancillarydata/initialize_spec.rb:110:in `block (4 levels) in <top (required)>'
/export/home/rubyci/unstable10s/tmp/build/20180809T151911Z/ruby/spec/ruby/library/socket/ancillarydata/initialize_spec.rb:4:in `block in <top (required)>'
/export/home/rubyci/unstable10s/tmp/build/20180809T151911Z/ruby/spec/ruby/library/socket/ancillarydata/initialize_spec.rb:3:in `<top (required)>'

90)
Socket::AncillaryData#unix_rights raises TypeError when the type is not SCM_RIGHTS ERROR
SocketError: unknown UNIX control message: TIMESTAMP
/export/home/rubyci/unstable10s/tmp/build/20180809T151911Z/ruby/spec/ruby/library/socket/ancillarydata/unix_rights_spec.rb:54:in `initialize'
/export/home/rubyci/unstable10s/tmp/build/20180809T151911Z/ruby/spec/ruby/library/socket/ancillarydata/unix_rights_spec.rb:54:in `new'
/export/home/rubyci/unstable10s/tmp/build/20180809T151911Z/ruby/spec/ruby/library/socket/ancillarydata/unix_rights_spec.rb:54:in `block (3 levels) in <top (required)>'
/export/home/rubyci/unstable10s/tmp/build/20180809T151911Z/ruby/spec/ruby/library/socket/ancillarydata/unix_rights_spec.rb:34:in `block in <top (required)>'
/export/home/rubyci/unstable10s/tmp/build/20180809T151911Z/ruby/spec/ruby/library/socket/ancillarydata/unix_rights_spec.rb:3:in `<top (required)>'

91)
Socket::Constants defines SCM options FAILED
Expected Socket::Constants to have constant 'SCM_CREDENTIALS' but it does not
/export/home/rubyci/unstable10s/tmp/build/20180809T151911Z/ruby/spec/ruby/library/socket/constants/constants_spec.rb:96:in `block (4 levels) in <top (required)>'
/export/home/rubyci/unstable10s/tmp/build/20180809T151911Z/ruby/spec/ruby/library/socket/constants/constants_spec.rb:95:in `block (3 levels) in <top (required)>'
/export/home/rubyci/unstable10s/tmp/build/20180809T151911Z/ruby/spec/ruby/library/socket/constants/constants_spec.rb:4:in `<top (required)>'

92)
Socket#connect_nonblock using IPv4 using a STREAM socket raises IO:EINPROGRESSWaitWritable when the connection would block ERROR
Errno::ECONNREFUSED: Connection refused - connect(2) for 127.0.0.1:43923
/export/home/rubyci/unstable10s/tmp/build/20180809T151911Z/ruby/.ext/common/socket.rb:1213:in `__connect_nonblock'
/export/home/rubyci/unstable10s/tmp/build/20180809T151911Z/ruby/.ext/common/socket.rb:1213:in `connect_nonblock'
/export/home/rubyci/unstable10s/tmp/build/20180809T151911Z/ruby/spec/ruby/library/socket/socket/connect_nonblock_spec.rb:116:in `block (5 levels) in <top (required)>'
/export/home/rubyci/unstable10s/tmp/build/20180809T151911Z/ruby/spec/ruby/library/socket/socket/connect_nonblock_spec.rb:115:in `block (4 levels) in <top (required)>'
/export/home/rubyci/unstable10s/tmp/build/20180809T151911Z/ruby/spec/ruby/library/socket/socket/connect_nonblock_spec.rb:71:in `<top (required)>'

93)
Socket#connect_nonblock using IPv6 using a STREAM socket raises IO:EINPROGRESSWaitWritable when the connection would block ERROR
Errno::ECONNREFUSED: Connection refused - connect(2) for [::1]:43925
/export/home/rubyci/unstable10s/tmp/build/20180809T151911Z/ruby/.ext/common/socket.rb:1213:in `__connect_nonblock'
/export/home/rubyci/unstable10s/tmp/build/20180809T151911Z/ruby/.ext/common/socket.rb:1213:in `connect_nonblock'
/export/home/rubyci/unstable10s/tmp/build/20180809T151911Z/ruby/spec/ruby/library/socket/socket/connect_nonblock_spec.rb:116:in `block (5 levels) in <top (required)>'
/export/home/rubyci/unstable10s/tmp/build/20180809T151911Z/ruby/spec/ruby/library/socket/socket/connect_nonblock_spec.rb:115:in `block (4 levels) in <top (required)>'
/export/home/rubyci/unstable10s/tmp/build/20180809T151911Z/ruby/spec/ruby/library/socket/socket/connect_nonblock_spec.rb:71:in `<top (required)>'

94)
Socket.getaddrinfo without global reverse lookups returns an Array ERROR
SocketError: getaddrinfo: service name not available for the specified socket type
/export/home/rubyci/unstable10s/tmp/build/20180809T151911Z/ruby/spec/ruby/library/socket/socket/getaddrinfo_spec.rb:115:in `getaddrinfo'
/export/home/rubyci/unstable10s/tmp/build/20180809T151911Z/ruby/spec/ruby/library/socket/socket/getaddrinfo_spec.rb:115:in `block (3 levels) in <top (required)>'
/export/home/rubyci/unstable10s/tmp/build/20180809T151911Z/ruby/spec/ruby/library/socket/socket/getaddrinfo_spec.rb:112:in `<top (required)>'

95)
Socket.getaddrinfo without global reverse lookups accepts a Fixnum as the address family ERROR
SocketError: getaddrinfo: service name not available for the specified socket type
/export/home/rubyci/unstable10s/tmp/build/20180809T151911Z/ruby/spec/ruby/library/socket/socket/getaddrinfo_spec.rb:119:in `getaddrinfo'
/export/home/rubyci/unstable10s/tmp/build/20180809T151911Z/ruby/spec/ruby/library/socket/socket/getaddrinfo_spec.rb:119:in `block (3 levels) in <top (required)>'
/export/home/rubyci/unstable10s/tmp/build/20180809T151911Z/ruby/spec/ruby/library/socket/socket/getaddrinfo_spec.rb:112:in `<top (required)>'

96)
Socket.getaddrinfo without global reverse lookups accepts a Fixnum as the address family using IPv6 ERROR
SocketError: getaddrinfo: service name not available for the specified socket type
/export/home/rubyci/unstable10s/tmp/build/20180809T151911Z/ruby/spec/ruby/library/socket/socket/getaddrinfo_spec.rb:131:in `getaddrinfo'
/export/home/rubyci/unstable10s/tmp/build/20180809T151911Z/ruby/spec/ruby/library/socket/socket/getaddrinfo_spec.rb:131:in `block (3 levels) in <top (required)>'
/export/home/rubyci/unstable10s/tmp/build/20180809T151911Z/ruby/spec/ruby/library/socket/socket/getaddrinfo_spec.rb:112:in `<top (required)>'

97)
Socket.getaddrinfo without global reverse lookups accepts a Symbol as the address family ERROR
SocketError: getaddrinfo: service name not available for the specified socket type
/export/home/rubyci/unstable10s/tmp/build/20180809T151911Z/ruby/spec/ruby/library/socket/socket/getaddrinfo_spec.rb:143:in `getaddrinfo'
/export/home/rubyci/unstable10s/tmp/build/20180809T151911Z/ruby/spec/ruby/library/socket/socket/getaddrinfo_spec.rb:143:in `block (3 levels) in <top (required)>'
/export/home/rubyci/unstable10s/tmp/build/20180809T151911Z/ruby/spec/ruby/library/socket/socket/getaddrinfo_spec.rb:112:in `<top (required)>'

98)
Socket.getaddrinfo without global reverse lookups accepts a Symbol as the address family using IPv6 ERROR
SocketError: getaddrinfo: service name not available for the specified socket type
/export/home/rubyci/unstable10s/tmp/build/20180809T151911Z/ruby/spec/ruby/library/socket/socket/getaddrinfo_spec.rb:155:in `getaddrinfo'
/export/home/rubyci/unstable10s/tmp/build/20180809T151911Z/ruby/spec/ruby/library/socket/socket/getaddrinfo_spec.rb:155:in `block (3 levels) in <top (required)>'
/export/home/rubyci/unstable10s/tmp/build/20180809T151911Z/ruby/spec/ruby/library/socket/socket/getaddrinfo_spec.rb:112:in `<top (required)>'

99)
Socket.getaddrinfo without global reverse lookups accepts a String as the address family ERROR
SocketError: getaddrinfo: service name not available for the specified socket type
/export/home/rubyci/unstable10s/tmp/build/20180809T151911Z/ruby/spec/ruby/library/socket/socket/getaddrinfo_spec.rb:167:in `getaddrinfo'
/export/home/rubyci/unstable10s/tmp/build/20180809T151911Z/ruby/spec/ruby/library/socket/socket/getaddrinfo_spec.rb:167:in `block (3 levels) in <top (required)>'
/export/home/rubyci/unstable10s/tmp/build/20180809T151911Z/ruby/spec/ruby/library/socket/socket/getaddrinfo_spec.rb:112:in `<top (required)>'

100)
Socket.getaddrinfo without global reverse lookups accepts a String as the address family using IPv6 ERROR
SocketError: getaddrinfo: service name not available for the specified socket type
/export/home/rubyci/unstable10s/tmp/build/20180809T151911Z/ruby/spec/ruby/library/socket/socket/getaddrinfo_spec.rb:179:in `getaddrinfo'
/export/home/rubyci/unstable10s/tmp/build/20180809T151911Z/ruby/spec/ruby/library/socket/socket/getaddrinfo_spec.rb:179:in `block (3 levels) in <top (required)>'
/export/home/rubyci/unstable10s/tmp/build/20180809T151911Z/ruby/spec/ruby/library/socket/socket/getaddrinfo_spec.rb:112:in `<top (required)>'

101)
Socket.getaddrinfo without global reverse lookups accepts an object responding to #to_str as the host ERROR
SocketError: getaddrinfo: service name not available for the specified socket type
/export/home/rubyci/unstable10s/tmp/build/20180809T151911Z/ruby/spec/ruby/library/socket/socket/getaddrinfo_spec.rb:195:in `getaddrinfo'
/export/home/rubyci/unstable10s/tmp/build/20180809T151911Z/ruby/spec/ruby/library/socket/socket/getaddrinfo_spec.rb:195:in `block (3 levels) in <top (required)>'
/export/home/rubyci/unstable10s/tmp/build/20180809T151911Z/ruby/spec/ruby/library/socket/socket/getaddrinfo_spec.rb:112:in `<top (required)>'

102)
Socket.getaddrinfo without global reverse lookups accepts an object responding to #to_str as the address family ERROR
SocketError: getaddrinfo: service name not available for the specified socket type
/export/home/rubyci/unstable10s/tmp/build/20180809T151911Z/ruby/spec/ruby/library/socket/socket/getaddrinfo_spec.rb:211:in `getaddrinfo'
/export/home/rubyci/unstable10s/tmp/build/20180809T151911Z/ruby/spec/ruby/library/socket/socket/getaddrinfo_spec.rb:211:in `block (3 levels) in <top (required)>'
/export/home/rubyci/unstable10s/tmp/build/20180809T151911Z/ruby/spec/ruby/library/socket/socket/getaddrinfo_spec.rb:112:in `<top (required)>'

103)
Socket.getaddrinfo without global reverse lookups accepts a Fixnum as the socket type ERROR
SocketError: getaddrinfo: service name not available for the specified socket type
/export/home/rubyci/unstable10s/tmp/build/20180809T151911Z/ruby/spec/ruby/library/socket/socket/getaddrinfo_spec.rb:228:in `getaddrinfo'
/export/home/rubyci/unstable10s/tmp/build/20180809T151911Z/ruby/spec/ruby/library/socket/socket/getaddrinfo_spec.rb:228:in `block (3 levels) in <top (required)>'
/export/home/rubyci/unstable10s/tmp/build/20180809T151911Z/ruby/spec/ruby/library/socket/socket/getaddrinfo_spec.rb:112:in `<top (required)>'

104)
Socket.getaddrinfo without global reverse lookups accepts a Symbol as the socket type ERROR
SocketError: getaddrinfo: service name not available for the specified socket type
/export/home/rubyci/unstable10s/tmp/build/20180809T151911Z/ruby/spec/ruby/library/socket/socket/getaddrinfo_spec.rb:240:in `getaddrinfo'
/export/home/rubyci/unstable10s/tmp/build/20180809T151911Z/ruby/spec/ruby/library/socket/socket/getaddrinfo_spec.rb:240:in `block (3 levels) in <top (required)>'
/export/home/rubyci/unstable10s/tmp/build/20180809T151911Z/ruby/spec/ruby/library/socket/socket/getaddrinfo_spec.rb:112:in `<top (required)>'

105)
Socket.getaddrinfo without global reverse lookups accepts a String as the socket type ERROR
SocketError: getaddrinfo: service name not available for the specified socket type
/export/home/rubyci/unstable10s/tmp/build/20180809T151911Z/ruby/spec/ruby/library/socket/socket/getaddrinfo_spec.rb:252:in `getaddrinfo'
/export/home/rubyci/unstable10s/tmp/build/20180809T151911Z/ruby/spec/ruby/library/socket/socket/getaddrinfo_spec.rb:252:in `block (3 levels) in <top (required)>'
/export/home/rubyci/unstable10s/tmp/build/20180809T151911Z/ruby/spec/ruby/library/socket/socket/getaddrinfo_spec.rb:112:in `<top (required)>'

106)
Socket.getaddrinfo without global reverse lookups accepts an object responding to #to_str as the socket type ERROR
SocketError: getaddrinfo: service name not available for the specified socket type
/export/home/rubyci/unstable10s/tmp/build/20180809T151911Z/ruby/spec/ruby/library/socket/socket/getaddrinfo_spec.rb:268:in `getaddrinfo'
/export/home/rubyci/unstable10s/tmp/build/20180809T151911Z/ruby/spec/ruby/library/socket/socket/getaddrinfo_spec.rb:268:in `block (3 levels) in <top (required)>'
/export/home/rubyci/unstable10s/tmp/build/20180809T151911Z/ruby/spec/ruby/library/socket/socket/getaddrinfo_spec.rb:112:in `<top (required)>'

107)
Socket.getaddrinfo without global reverse lookups accepts a Fixnum as the flags ERROR
SocketError: getaddrinfo: service name not available for the specified socket type
/export/home/rubyci/unstable10s/tmp/build/20180809T151911Z/ruby/spec/ruby/library/socket/socket/getaddrinfo_spec.rb:296:in `getaddrinfo'
/export/home/rubyci/unstable10s/tmp/build/20180809T151911Z/ruby/spec/ruby/library/socket/socket/getaddrinfo_spec.rb:296:in `block (3 levels) in <top (required)>'
/export/home/rubyci/unstable10s/tmp/build/20180809T151911Z/ruby/spec/ruby/library/socket/socket/getaddrinfo_spec.rb:112:in `<top (required)>'

108)
Socket.getaddrinfo without global reverse lookups performs a reverse lookup when the reverse_lookup argument is true ERROR
SocketError: getaddrinfo: service name not available for the specified socket type
/export/home/rubyci/unstable10s/tmp/build/20180809T151911Z/ruby/spec/ruby/library/socket/socket/getaddrinfo_spec.rb:311:in `getaddrinfo'
/export/home/rubyci/unstable10s/tmp/build/20180809T151911Z/ruby/spec/ruby/library/socket/socket/getaddrinfo_spec.rb:311:in `block (3 levels) in <top (required)>'
/export/home/rubyci/unstable10s/tmp/build/20180809T151911Z/ruby/spec/ruby/library/socket/socket/getaddrinfo_spec.rb:112:in `<top (required)>'

109)
Socket.getaddrinfo without global reverse lookups performs a reverse lookup when the reverse_lookup argument is :hostname ERROR
SocketError: getaddrinfo: service name not available for the specified socket type
/export/home/rubyci/unstable10s/tmp/build/20180809T151911Z/ruby/spec/ruby/library/socket/socket/getaddrinfo_spec.rb:324:in `getaddrinfo'
/export/home/rubyci/unstable10s/tmp/build/20180809T151911Z/ruby/spec/ruby/library/socket/socket/getaddrinfo_spec.rb:324:in `block (3 levels) in <top (required)>'
/export/home/rubyci/unstable10s/tmp/build/20180809T151911Z/ruby/spec/ruby/library/socket/socket/getaddrinfo_spec.rb:112:in `<top (required)>'

110)
Socket.getaddrinfo without global reverse lookups performs a reverse lookup when the reverse_lookup argument is :numeric ERROR
SocketError: getaddrinfo: service name not available for the specified socket type
/export/home/rubyci/unstable10s/tmp/build/20180809T151911Z/ruby/spec/ruby/library/socket/socket/getaddrinfo_spec.rb:337:in `getaddrinfo'
/export/home/rubyci/unstable10s/tmp/build/20180809T151911Z/ruby/spec/ruby/library/socket/socket/getaddrinfo_spec.rb:337:in `block (3 levels) in <top (required)>'
/export/home/rubyci/unstable10s/tmp/build/20180809T151911Z/ruby/spec/ruby/library/socket/socket/getaddrinfo_spec.rb:112:in `<top (required)>'

111)
Socket.getaddrinfo with global reverse lookups returns an address honoring the global lookup option ERROR
SocketError: getaddrinfo: service name not available for the specified socket type
/export/home/rubyci/unstable10s/tmp/build/20180809T151911Z/ruby/spec/ruby/library/socket/socket/getaddrinfo_spec.rb:363:in `getaddrinfo'
/export/home/rubyci/unstable10s/tmp/build/20180809T151911Z/ruby/spec/ruby/library/socket/socket/getaddrinfo_spec.rb:363:in `block (3 levels) in <top (required)>'
/export/home/rubyci/unstable10s/tmp/build/20180809T151911Z/ruby/spec/ruby/library/socket/socket/getaddrinfo_spec.rb:112:in `<top (required)>'

112)
An exception occurred during: before :each
Socket.getifaddrs returns an Array ERROR
NotImplementedError: getifaddrs() function is unimplemented on this machine
/export/home/rubyci/unstable10s/tmp/build/20180809T151911Z/ruby/spec/ruby/library/socket/socket/getifaddrs_spec.rb:5:in `getifaddrs'
/export/home/rubyci/unstable10s/tmp/build/20180809T151911Z/ruby/spec/ruby/library/socket/socket/getifaddrs_spec.rb:5:in `block (2 levels) in <top (required)>'
/export/home/rubyci/unstable10s/tmp/build/20180809T151911Z/ruby/spec/ruby/library/socket/socket/getifaddrs_spec.rb:3:in `<top (required)>'

113)
An exception occurred during: before :each
Socket.getifaddrs the returned Array should not be empty ERROR
NotImplementedError: getifaddrs() function is unimplemented on this machine
/export/home/rubyci/unstable10s/tmp/build/20180809T151911Z/ruby/spec/ruby/library/socket/socket/getifaddrs_spec.rb:5:in `getifaddrs'
/export/home/rubyci/unstable10s/tmp/build/20180809T151911Z/ruby/spec/ruby/library/socket/socket/getifaddrs_spec.rb:5:in `block (2 levels) in <top (required)>'
/export/home/rubyci/unstable10s/tmp/build/20180809T151911Z/ruby/spec/ruby/library/socket/socket/getifaddrs_spec.rb:3:in `<top (required)>'

114)
An exception occurred during: before :each
Socket.getifaddrs the returned Array contains instances of Socket::Ifaddr ERROR
NotImplementedError: getifaddrs() function is unimplemented on this machine
/export/home/rubyci/unstable10s/tmp/build/20180809T151911Z/ruby/spec/ruby/library/socket/socket/getifaddrs_spec.rb:5:in `getifaddrs'
/export/home/rubyci/unstable10s/tmp/build/20180809T151911Z/ruby/spec/ruby/library/socket/socket/getifaddrs_spec.rb:5:in `block (2 levels) in <top (required)>'
/export/home/rubyci/unstable10s/tmp/build/20180809T151911Z/ruby/spec/ruby/library/socket/socket/getifaddrs_spec.rb:3:in `<top (required)>'

115)
An exception occurred during: before :each
Socket.getifaddrs each returned Socket::Ifaddr has an interface index ERROR
NotImplementedError: getifaddrs() function is unimplemented on this machine
/export/home/rubyci/unstable10s/tmp/build/20180809T151911Z/ruby/spec/ruby/library/socket/socket/getifaddrs_spec.rb:5:in `getifaddrs'
/export/home/rubyci/unstable10s/tmp/build/20180809T151911Z/ruby/spec/ruby/library/socket/socket/getifaddrs_spec.rb:5:in `block (2 levels) in <top (required)>'
/export/home/rubyci/unstable10s/tmp/build/20180809T151911Z/ruby/spec/ruby/library/socket/socket/getifaddrs_spec.rb:3:in `<top (required)>'

116)
An exception occurred during: before :each
Socket.getifaddrs each returned Socket::Ifaddr has an interface name ERROR
NotImplementedError: getifaddrs() function is unimplemented on this machine
/export/home/rubyci/unstable10s/tmp/build/20180809T151911Z/ruby/spec/ruby/library/socket/socket/getifaddrs_spec.rb:5:in `getifaddrs'
/export/home/rubyci/unstable10s/tmp/build/20180809T151911Z/ruby/spec/ruby/library/socket/socket/getifaddrs_spec.rb:5:in `block (2 levels) in <top (required)>'
/export/home/rubyci/unstable10s/tmp/build/20180809T151911Z/ruby/spec/ruby/library/socket/socket/getifaddrs_spec.rb:3:in `<top (required)>'

117)
An exception occurred during: before :each
Socket.getifaddrs each returned Socket::Ifaddr has a set of flags ERROR
NotImplementedError: getifaddrs() function is unimplemented on this machine
/export/home/rubyci/unstable10s/tmp/build/20180809T151911Z/ruby/spec/ruby/library/socket/socket/getifaddrs_spec.rb:5:in `getifaddrs'
/export/home/rubyci/unstable10s/tmp/build/20180809T151911Z/ruby/spec/ruby/library/socket/socket/getifaddrs_spec.rb:5:in `block (2 levels) in <top (required)>'
/export/home/rubyci/unstable10s/tmp/build/20180809T151911Z/ruby/spec/ruby/library/socket/socket/getifaddrs_spec.rb:3:in `<top (required)>'

118)
An exception occurred during: before :each
Socket.getifaddrs the Socket::Ifaddr address is an Addrinfo ERROR
NotImplementedError: getifaddrs() function is unimplemented on this machine
/export/home/rubyci/unstable10s/tmp/build/20180809T151911Z/ruby/spec/ruby/library/socket/socket/getifaddrs_spec.rb:5:in `getifaddrs'
/export/home/rubyci/unstable10s/tmp/build/20180809T151911Z/ruby/spec/ruby/library/socket/socket/getifaddrs_spec.rb:5:in `block (2 levels) in <top (required)>'
/export/home/rubyci/unstable10s/tmp/build/20180809T151911Z/ruby/spec/ruby/library/socket/socket/getifaddrs_spec.rb:3:in `<top (required)>'

119)
An exception occurred during: before :each
Socket.getifaddrs the Socket::Ifaddr address has an address family ERROR
NotImplementedError: getifaddrs() function is unimplemented on this machine
/export/home/rubyci/unstable10s/tmp/build/20180809T151911Z/ruby/spec/ruby/library/socket/socket/getifaddrs_spec.rb:5:in `getifaddrs'
/export/home/rubyci/unstable10s/tmp/build/20180809T151911Z/ruby/spec/ruby/library/socket/socket/getifaddrs_spec.rb:5:in `block (2 levels) in <top (required)>'
/export/home/rubyci/unstable10s/tmp/build/20180809T151911Z/ruby/spec/ruby/library/socket/socket/getifaddrs_spec.rb:3:in `<top (required)>'

120)
An exception occurred during: before :each
Socket.getifaddrs the Socket::Ifaddr broadcast address is an Addrinfo ERROR
NotImplementedError: getifaddrs() function is unimplemented on this machine
/export/home/rubyci/unstable10s/tmp/build/20180809T151911Z/ruby/spec/ruby/library/socket/socket/getifaddrs_spec.rb:5:in `getifaddrs'
/export/home/rubyci/unstable10s/tmp/build/20180809T151911Z/ruby/spec/ruby/library/socket/socket/getifaddrs_spec.rb:5:in `block (2 levels) in <top (required)>'
/export/home/rubyci/unstable10s/tmp/build/20180809T151911Z/ruby/spec/ruby/library/socket/socket/getifaddrs_spec.rb:3:in `<top (required)>'

121)
An exception occurred during: before :each
Socket.getifaddrs the Socket::Ifaddr broadcast address has an address family ERROR
NotImplementedError: getifaddrs() function is unimplemented on this machine
/export/home/rubyci/unstable10s/tmp/build/20180809T151911Z/ruby/spec/ruby/library/socket/socket/getifaddrs_spec.rb:5:in `getifaddrs'
/export/home/rubyci/unstable10s/tmp/build/20180809T151911Z/ruby/spec/ruby/library/socket/socket/getifaddrs_spec.rb:5:in `block (2 levels) in <top (required)>'
/export/home/rubyci/unstable10s/tmp/build/20180809T151911Z/ruby/spec/ruby/library/socket/socket/getifaddrs_spec.rb:3:in `<top (required)>'

122)
An exception occurred during: before :each
Socket.getifaddrs the Socket::Ifaddr netmask address is an Addrinfo ERROR
NotImplementedError: getifaddrs() function is unimplemented on this machine
/export/home/rubyci/unstable10s/tmp/build/20180809T151911Z/ruby/spec/ruby/library/socket/socket/getifaddrs_spec.rb:5:in `getifaddrs'
/export/home/rubyci/unstable10s/tmp/build/20180809T151911Z/ruby/spec/ruby/library/socket/socket/getifaddrs_spec.rb:5:in `block (2 levels) in <top (required)>'
/export/home/rubyci/unstable10s/tmp/build/20180809T151911Z/ruby/spec/ruby/library/socket/socket/getifaddrs_spec.rb:3:in `<top (required)>'

123)
An exception occurred during: before :each
Socket.getifaddrs the Socket::Ifaddr netmask address has an address family ERROR
NotImplementedError: getifaddrs() function is unimplemented on this machine
/export/home/rubyci/unstable10s/tmp/build/20180809T151911Z/ruby/spec/ruby/library/socket/socket/getifaddrs_spec.rb:5:in `getifaddrs'
/export/home/rubyci/unstable10s/tmp/build/20180809T151911Z/ruby/spec/ruby/library/socket/socket/getifaddrs_spec.rb:5:in `block (2 levels) in <top (required)>'
/export/home/rubyci/unstable10s/tmp/build/20180809T151911Z/ruby/spec/ruby/library/socket/socket/getifaddrs_spec.rb:3:in `<top (required)>'

124)
An exception occurred during: before :each
Socket.getifaddrs the Socket::Ifaddr netmask address has an IP address ERROR
NotImplementedError: getifaddrs() function is unimplemented on this machine
/export/home/rubyci/unstable10s/tmp/build/20180809T151911Z/ruby/spec/ruby/library/socket/socket/getifaddrs_spec.rb:5:in `getifaddrs'
/export/home/rubyci/unstable10s/tmp/build/20180809T151911Z/ruby/spec/ruby/library/socket/socket/getifaddrs_spec.rb:5:in `block (2 levels) in <top (required)>'
/export/home/rubyci/unstable10s/tmp/build/20180809T151911Z/ruby/spec/ruby/library/socket/socket/getifaddrs_spec.rb:3:in `<top (required)>'

125)
Socket.getnameinfo using a String as the first argument without custom flags returns an Array containing the hostname and service name FAILED
Expected ["localhost", "80"]
 to equal ["localhost", "http"]

/export/home/rubyci/unstable10s/tmp/build/20180809T151911Z/ruby/spec/ruby/library/socket/socket/getnameinfo_spec.rb:77:in `block (4 levels) in <top (required)>'
/export/home/rubyci/unstable10s/tmp/build/20180809T151911Z/ruby/spec/ruby/library/socket/socket/getnameinfo_spec.rb:65:in `<top (required)>'

126)
Socket.getnameinfo using a String as the first argument using NI_NUMERICHOST as the flag returns an Array containing the numeric hostname and service name FAILED
Expected "80"
 to equal "http"

/export/home/rubyci/unstable10s/tmp/build/20180809T151911Z/ruby/spec/ruby/library/socket/socket/getnameinfo_spec.rb:87:in `block (4 levels) in <top (required)>'
/export/home/rubyci/unstable10s/tmp/build/20180809T151911Z/ruby/spec/ruby/library/socket/socket/getnameinfo_spec.rb:65:in `<top (required)>'

127)
Socket.getnameinfo using IPv4 using a 3 element Array as the first argument without custom flags returns an Array containing the hostname and service name FAILED
Expected "80"
 to equal "http"

/export/home/rubyci/unstable10s/tmp/build/20180809T151911Z/ruby/spec/ruby/library/socket/socket/getnameinfo_spec.rb:111:in `block (5 levels) in <top (required)>'
/export/home/rubyci/unstable10s/tmp/build/20180809T151911Z/ruby/spec/ruby/library/socket/socket/getnameinfo_spec.rb:65:in `<top (required)>'

128)
Socket.getnameinfo using IPv4 using a 3 element Array as the first argument using NI_NUMERICHOST as the flag returns an Array containing the numeric hostname and service name FAILED
Expected ["127.0.0.1", "80"]
 to equal ["127.0.0.1", "http"]

/export/home/rubyci/unstable10s/tmp/build/20180809T151911Z/ruby/spec/ruby/library/socket/socket/getnameinfo_spec.rb:118:in `block (6 levels) in <top (required)>'
/export/home/rubyci/unstable10s/tmp/build/20180809T151911Z/ruby/spec/ruby/library/socket/socket/getnameinfo_spec.rb:65:in `<top (required)>'

129)
Socket.getnameinfo using IPv4 using a 4 element Array as the first argument without custom flags returns an Array containing the hostname and service name FAILED
Expected "80"
 to equal "http"

/export/home/rubyci/unstable10s/tmp/build/20180809T151911Z/ruby/spec/ruby/library/socket/socket/getnameinfo_spec.rb:134:in `block (5 levels) in <top (required)>'
/export/home/rubyci/unstable10s/tmp/build/20180809T151911Z/ruby/spec/ruby/library/socket/socket/getnameinfo_spec.rb:65:in `<top (required)>'

130)
Socket.getnameinfo using IPv4 using a 4 element Array as the first argument without custom flags uses the 3rd value as the hostname if the 4th is not present FAILED
Expected "80"
 to equal "http"

/export/home/rubyci/unstable10s/tmp/build/20180809T151911Z/ruby/spec/ruby/library/socket/socket/getnameinfo_spec.rb:143:in `block (5 levels) in <top (required)>'
/export/home/rubyci/unstable10s/tmp/build/20180809T151911Z/ruby/spec/ruby/library/socket/socket/getnameinfo_spec.rb:65:in `<top (required)>'

131)
Socket.getnameinfo using IPv4 using a 4 element Array as the first argument using NI_NUMERICHOST as the flag returns an Array containing the numeric hostname and service name FAILED
Expected ["127.0.0.1", "80"]
 to equal ["127.0.0.1", "http"]

/export/home/rubyci/unstable10s/tmp/build/20180809T151911Z/ruby/spec/ruby/library/socket/socket/getnameinfo_spec.rb:149:in `block (5 levels) in <top (required)>'
/export/home/rubyci/unstable10s/tmp/build/20180809T151911Z/ruby/spec/ruby/library/socket/socket/getnameinfo_spec.rb:65:in `<top (required)>'

132)
Socket.getnameinfo using IPv6 using a 3 element Array as the first argument without custom flags returns an Array containing the hostname and service name FAILED
Expected "80"
 to equal "http"

/export/home/rubyci/unstable10s/tmp/build/20180809T151911Z/ruby/spec/ruby/library/socket/socket/getnameinfo_spec.rb:111:in `block (5 levels) in <top (required)>'
/export/home/rubyci/unstable10s/tmp/build/20180809T151911Z/ruby/spec/ruby/library/socket/socket/getnameinfo_spec.rb:65:in `<top (required)>'

133)
Socket.getnameinfo using IPv6 using a 3 element Array as the first argument using NI_NUMERICHOST as the flag returns an Array containing the numeric hostname and service name FAILED
Expected ["::1", "80"]
 to equal ["::1", "http"]

/export/home/rubyci/unstable10s/tmp/build/20180809T151911Z/ruby/spec/ruby/library/socket/socket/getnameinfo_spec.rb:118:in `block (6 levels) in <top (required)>'
/export/home/rubyci/unstable10s/tmp/build/20180809T151911Z/ruby/spec/ruby/library/socket/socket/getnameinfo_spec.rb:65:in `<top (required)>'

134)
Socket.getnameinfo using IPv6 using a 4 element Array as the first argument without custom flags returns an Array containing the hostname and service name FAILED
Expected "80"
 to equal "http"

/export/home/rubyci/unstable10s/tmp/build/20180809T151911Z/ruby/spec/ruby/library/socket/socket/getnameinfo_spec.rb:134:in `block (5 levels) in <top (required)>'
/export/home/rubyci/unstable10s/tmp/build/20180809T151911Z/ruby/spec/ruby/library/socket/socket/getnameinfo_spec.rb:65:in `<top (required)>'

135)
Socket.getnameinfo using IPv6 using a 4 element Array as the first argument without custom flags uses the 3rd value as the hostname if the 4th is not present FAILED
Expected "80"
 to equal "http"

/export/home/rubyci/unstable10s/tmp/build/20180809T151911Z/ruby/spec/ruby/library/socket/socket/getnameinfo_spec.rb:143:in `block (5 levels) in <top (required)>'
/export/home/rubyci/unstable10s/tmp/build/20180809T151911Z/ruby/spec/ruby/library/socket/socket/getnameinfo_spec.rb:65:in `<top (required)>'

136)
Socket.getnameinfo using IPv6 using a 4 element Array as the first argument using NI_NUMERICHOST as the flag returns an Array containing the numeric hostname and service name FAILED
Expected ["::1", "80"]
 to equal ["::1", "http"]

/export/home/rubyci/unstable10s/tmp/build/20180809T151911Z/ruby/spec/ruby/library/socket/socket/getnameinfo_spec.rb:149:in `block (5 levels) in <top (required)>'
/export/home/rubyci/unstable10s/tmp/build/20180809T151911Z/ruby/spec/ruby/library/socket/socket/getnameinfo_spec.rb:65:in `<top (required)>'

137)
Socket#getservbyname returns the port for service "http" ERROR
SocketError: no such service http/tcp
/export/home/rubyci/unstable10s/tmp/build/20180809T151911Z/ruby/spec/ruby/library/socket/socket/getservbyname_spec.rb:14:in `getservbyname'
/export/home/rubyci/unstable10s/tmp/build/20180809T151911Z/ruby/spec/ruby/library/socket/socket/getservbyname_spec.rb:14:in `block (2 levels) in <top (required)>'
/export/home/rubyci/unstable10s/tmp/build/20180809T151911Z/ruby/spec/ruby/library/socket/socket/getservbyname_spec.rb:4:in `<top (required)>'

138)
Socket#getservbyname returns the port for service "http" with protocol "tcp" ERROR
SocketError: no such service http/tcp
/export/home/rubyci/unstable10s/tmp/build/20180809T151911Z/ruby/spec/ruby/library/socket/socket/getservbyname_spec.rb:18:in `getservbyname'
/export/home/rubyci/unstable10s/tmp/build/20180809T151911Z/ruby/spec/ruby/library/socket/socket/getservbyname_spec.rb:18:in `block (2 levels) in <top (required)>'
/export/home/rubyci/unstable10s/tmp/build/20180809T151911Z/ruby/spec/ruby/library/socket/socket/getservbyname_spec.rb:4:in `<top (required)>'

139)
Socket#pack_sockaddr_in using an IPv6 address returns a String of 28 bytes FAILED
Expected 32
 to equal 28

/export/home/rubyci/unstable10s/tmp/build/20180809T151911Z/ruby/spec/ruby/library/socket/shared/pack_sockaddr.rb:36:in `block (3 levels) in <top (required)>'
/export/home/rubyci/unstable10s/tmp/build/20180809T151911Z/ruby/spec/ruby/library/socket/socket/pack_sockaddr_in_spec.rb:5:in `<top (required)>'

140)
Socket#sockaddr_in using an IPv6 address returns a String of 28 bytes FAILED
Expected 32
 to equal 28

/export/home/rubyci/unstable10s/tmp/build/20180809T151911Z/ruby/spec/ruby/library/socket/shared/pack_sockaddr.rb:36:in `block (3 levels) in <top (required)>'
/export/home/rubyci/unstable10s/tmp/build/20180809T151911Z/ruby/spec/ruby/library/socket/socket/sockaddr_in_spec.rb:5:in `<top (required)>'

Finished in 932.621909 seconds

3690 files, 29735 examples, 212531 expectations, 98 failures, 42 errors, 0 tagged
gmake: *** [uncommon.mk:774: yes-test-spec] Error 1
exit 2
failed(rubyspec)

20180809T101912Z(failure) < OlderDiff < 20180809T151911Z(failure) > NewerDiff > 20180810T111914Z(failure)


chkbuild summary recent last