r64273 ruby 2.6.0dev (2018-08-10) [i386-solaris2.10] (unstable10x) 456W rubyspec:2F21E

chkbuild summary recent last

20180810T111811Z(failure) < OlderDiff < 20180810T121808Z(failure) > NewerDiff > 20180810T131808Z(failure)

== rubyspec # 2018-08-10T14:50:09+02:00 (full)
...(snip 49315 lines)...
- breaks a loop
- breaks the inner loop

C-API Util function rb_sourcefile
- returns the current ruby file

C-API Util function rb_sourceline
- returns the current ruby file


1)
Addrinfo.getaddrinfo returns an Array of Addrinfo instances ERROR
SocketError: getaddrinfo: node name or service name not known
/export/home/rubyci/chkbuild-tmp/tmp/build/20180810T121808Z/ruby/spec/ruby/library/socket/addrinfo/getaddrinfo_spec.rb:6:in `getaddrinfo'
/export/home/rubyci/chkbuild-tmp/tmp/build/20180810T121808Z/ruby/spec/ruby/library/socket/addrinfo/getaddrinfo_spec.rb:6:in `block (2 levels) in <top (required)>'
/export/home/rubyci/chkbuild-tmp/tmp/build/20180810T121808Z/ruby/spec/ruby/library/socket/addrinfo/getaddrinfo_spec.rb:4:in `<top (required)>'

2)
Addrinfo.getaddrinfo sets the default socket type of the Addrinfo instances ERROR
SocketError: getaddrinfo: node name or service name not known
/export/home/rubyci/chkbuild-tmp/tmp/build/20180810T121808Z/ruby/spec/ruby/library/socket/addrinfo/getaddrinfo_spec.rb:54:in `getaddrinfo'
/export/home/rubyci/chkbuild-tmp/tmp/build/20180810T121808Z/ruby/spec/ruby/library/socket/addrinfo/getaddrinfo_spec.rb:54:in `block (3 levels) in <top (required)>'
/export/home/rubyci/chkbuild-tmp/tmp/build/20180810T121808Z/ruby/spec/ruby/library/socket/addrinfo/getaddrinfo_spec.rb:4:in `<top (required)>'

3)
Addrinfo.getaddrinfo sets the default socket protocol of the Addrinfo instances ERROR
SocketError: getaddrinfo: node name or service name not known
/export/home/rubyci/chkbuild-tmp/tmp/build/20180810T121808Z/ruby/spec/ruby/library/socket/addrinfo/getaddrinfo_spec.rb:69:in `getaddrinfo'
/export/home/rubyci/chkbuild-tmp/tmp/build/20180810T121808Z/ruby/spec/ruby/library/socket/addrinfo/getaddrinfo_spec.rb:69:in `block (3 levels) in <top (required)>'
/export/home/rubyci/chkbuild-tmp/tmp/build/20180810T121808Z/ruby/spec/ruby/library/socket/addrinfo/getaddrinfo_spec.rb:4:in `<top (required)>'

4)
Addrinfo.getaddrinfo sets a custom socket protocol of the Addrinfo instances FAILED
Expected 0
 to equal 17

/export/home/rubyci/chkbuild-tmp/tmp/build/20180810T121808Z/ruby/spec/ruby/library/socket/addrinfo/getaddrinfo_spec.rb:79:in `block (2 levels) in <top (required)>'
/export/home/rubyci/chkbuild-tmp/tmp/build/20180810T121808Z/ruby/spec/ruby/library/socket/addrinfo/getaddrinfo_spec.rb:4:in `<top (required)>'

5)
Addrinfo.getaddrinfo sets the canonical name when AI_CANONNAME is given as a flag ERROR
SocketError: getaddrinfo: node name or service name not known
/export/home/rubyci/chkbuild-tmp/tmp/build/20180810T121808Z/ruby/spec/ruby/library/socket/addrinfo/getaddrinfo_spec.rb:84:in `getaddrinfo'
/export/home/rubyci/chkbuild-tmp/tmp/build/20180810T121808Z/ruby/spec/ruby/library/socket/addrinfo/getaddrinfo_spec.rb:84:in `block (2 levels) in <top (required)>'
/export/home/rubyci/chkbuild-tmp/tmp/build/20180810T121808Z/ruby/spec/ruby/library/socket/addrinfo/getaddrinfo_spec.rb:4:in `<top (required)>'

6)
Addrinfo#marshal_dump using an IP Addrinfo the returned Array includes the protocol as the 5th value FAILED
Expected 0
 to equal "IPPROTO_TCP"

/export/home/rubyci/chkbuild-tmp/tmp/build/20180810T121808Z/ruby/spec/ruby/library/socket/addrinfo/marshal_dump_spec.rb:36:in `block (4 levels) in <top (required)>'
/export/home/rubyci/chkbuild-tmp/tmp/build/20180810T121808Z/ruby/spec/ruby/library/socket/addrinfo/marshal_dump_spec.rb:3:in `<top (required)>'

7)
Socket::AncillaryData#initialize using :AF_INET as the family and :SOCKET as the level sets the type to SCM_TIMESTAMP when using :TIMESTAMP as the type argument ERROR
SocketError: unknown UNIX control message: TIMESTAMP
/export/home/rubyci/chkbuild-tmp/tmp/build/20180810T121808Z/ruby/spec/ruby/library/socket/ancillarydata/initialize_spec.rb:110:in `initialize'
/export/home/rubyci/chkbuild-tmp/tmp/build/20180810T121808Z/ruby/spec/ruby/library/socket/ancillarydata/initialize_spec.rb:110:in `new'
/export/home/rubyci/chkbuild-tmp/tmp/build/20180810T121808Z/ruby/spec/ruby/library/socket/ancillarydata/initialize_spec.rb:110:in `block (4 levels) in <top (required)>'
/export/home/rubyci/chkbuild-tmp/tmp/build/20180810T121808Z/ruby/spec/ruby/library/socket/ancillarydata/initialize_spec.rb:4:in `block in <top (required)>'
/export/home/rubyci/chkbuild-tmp/tmp/build/20180810T121808Z/ruby/spec/ruby/library/socket/ancillarydata/initialize_spec.rb:3:in `<top (required)>'

8)
Socket::AncillaryData#unix_rights raises TypeError when the type is not SCM_RIGHTS ERROR
SocketError: unknown UNIX control message: TIMESTAMP
/export/home/rubyci/chkbuild-tmp/tmp/build/20180810T121808Z/ruby/spec/ruby/library/socket/ancillarydata/unix_rights_spec.rb:54:in `initialize'
/export/home/rubyci/chkbuild-tmp/tmp/build/20180810T121808Z/ruby/spec/ruby/library/socket/ancillarydata/unix_rights_spec.rb:54:in `new'
/export/home/rubyci/chkbuild-tmp/tmp/build/20180810T121808Z/ruby/spec/ruby/library/socket/ancillarydata/unix_rights_spec.rb:54:in `block (3 levels) in <top (required)>'
/export/home/rubyci/chkbuild-tmp/tmp/build/20180810T121808Z/ruby/spec/ruby/library/socket/ancillarydata/unix_rights_spec.rb:34:in `block in <top (required)>'
/export/home/rubyci/chkbuild-tmp/tmp/build/20180810T121808Z/ruby/spec/ruby/library/socket/ancillarydata/unix_rights_spec.rb:3:in `<top (required)>'

9)
Socket#connect_nonblock using IPv4 using a STREAM socket raises IO:EINPROGRESSWaitWritable when the connection would block ERROR
Errno::ECONNREFUSED: Connection refused - connect(2) for 127.0.0.1:46273
/export/home/rubyci/chkbuild-tmp/tmp/build/20180810T121808Z/ruby/.ext/common/socket.rb:1213:in `__connect_nonblock'
/export/home/rubyci/chkbuild-tmp/tmp/build/20180810T121808Z/ruby/.ext/common/socket.rb:1213:in `connect_nonblock'
/export/home/rubyci/chkbuild-tmp/tmp/build/20180810T121808Z/ruby/spec/ruby/library/socket/socket/connect_nonblock_spec.rb:116:in `block (5 levels) in <top (required)>'
/export/home/rubyci/chkbuild-tmp/tmp/build/20180810T121808Z/ruby/spec/ruby/library/socket/socket/connect_nonblock_spec.rb:115:in `block (4 levels) in <top (required)>'
/export/home/rubyci/chkbuild-tmp/tmp/build/20180810T121808Z/ruby/spec/ruby/library/socket/socket/connect_nonblock_spec.rb:71:in `<top (required)>'

10)
Socket#connect_nonblock using IPv6 using a STREAM socket raises IO:EINPROGRESSWaitWritable when the connection would block ERROR
Errno::ECONNREFUSED: Connection refused - connect(2) for [::1]:46275
/export/home/rubyci/chkbuild-tmp/tmp/build/20180810T121808Z/ruby/.ext/common/socket.rb:1213:in `__connect_nonblock'
/export/home/rubyci/chkbuild-tmp/tmp/build/20180810T121808Z/ruby/.ext/common/socket.rb:1213:in `connect_nonblock'
/export/home/rubyci/chkbuild-tmp/tmp/build/20180810T121808Z/ruby/spec/ruby/library/socket/socket/connect_nonblock_spec.rb:116:in `block (5 levels) in <top (required)>'
/export/home/rubyci/chkbuild-tmp/tmp/build/20180810T121808Z/ruby/spec/ruby/library/socket/socket/connect_nonblock_spec.rb:115:in `block (4 levels) in <top (required)>'
/export/home/rubyci/chkbuild-tmp/tmp/build/20180810T121808Z/ruby/spec/ruby/library/socket/socket/connect_nonblock_spec.rb:71:in `<top (required)>'

11)
An exception occurred during: before :each
Socket.getifaddrs returns an Array ERROR
NotImplementedError: getifaddrs() function is unimplemented on this machine
/export/home/rubyci/chkbuild-tmp/tmp/build/20180810T121808Z/ruby/spec/ruby/library/socket/socket/getifaddrs_spec.rb:5:in `getifaddrs'
/export/home/rubyci/chkbuild-tmp/tmp/build/20180810T121808Z/ruby/spec/ruby/library/socket/socket/getifaddrs_spec.rb:5:in `block (2 levels) in <top (required)>'
/export/home/rubyci/chkbuild-tmp/tmp/build/20180810T121808Z/ruby/spec/ruby/library/socket/socket/getifaddrs_spec.rb:3:in `<top (required)>'

12)
An exception occurred during: before :each
Socket.getifaddrs the returned Array should not be empty ERROR
NotImplementedError: getifaddrs() function is unimplemented on this machine
/export/home/rubyci/chkbuild-tmp/tmp/build/20180810T121808Z/ruby/spec/ruby/library/socket/socket/getifaddrs_spec.rb:5:in `getifaddrs'
/export/home/rubyci/chkbuild-tmp/tmp/build/20180810T121808Z/ruby/spec/ruby/library/socket/socket/getifaddrs_spec.rb:5:in `block (2 levels) in <top (required)>'
/export/home/rubyci/chkbuild-tmp/tmp/build/20180810T121808Z/ruby/spec/ruby/library/socket/socket/getifaddrs_spec.rb:3:in `<top (required)>'

13)
An exception occurred during: before :each
Socket.getifaddrs the returned Array contains instances of Socket::Ifaddr ERROR
NotImplementedError: getifaddrs() function is unimplemented on this machine
/export/home/rubyci/chkbuild-tmp/tmp/build/20180810T121808Z/ruby/spec/ruby/library/socket/socket/getifaddrs_spec.rb:5:in `getifaddrs'
/export/home/rubyci/chkbuild-tmp/tmp/build/20180810T121808Z/ruby/spec/ruby/library/socket/socket/getifaddrs_spec.rb:5:in `block (2 levels) in <top (required)>'
/export/home/rubyci/chkbuild-tmp/tmp/build/20180810T121808Z/ruby/spec/ruby/library/socket/socket/getifaddrs_spec.rb:3:in `<top (required)>'

14)
An exception occurred during: before :each
Socket.getifaddrs each returned Socket::Ifaddr has an interface index ERROR
NotImplementedError: getifaddrs() function is unimplemented on this machine
/export/home/rubyci/chkbuild-tmp/tmp/build/20180810T121808Z/ruby/spec/ruby/library/socket/socket/getifaddrs_spec.rb:5:in `getifaddrs'
/export/home/rubyci/chkbuild-tmp/tmp/build/20180810T121808Z/ruby/spec/ruby/library/socket/socket/getifaddrs_spec.rb:5:in `block (2 levels) in <top (required)>'
/export/home/rubyci/chkbuild-tmp/tmp/build/20180810T121808Z/ruby/spec/ruby/library/socket/socket/getifaddrs_spec.rb:3:in `<top (required)>'

15)
An exception occurred during: before :each
Socket.getifaddrs each returned Socket::Ifaddr has an interface name ERROR
NotImplementedError: getifaddrs() function is unimplemented on this machine
/export/home/rubyci/chkbuild-tmp/tmp/build/20180810T121808Z/ruby/spec/ruby/library/socket/socket/getifaddrs_spec.rb:5:in `getifaddrs'
/export/home/rubyci/chkbuild-tmp/tmp/build/20180810T121808Z/ruby/spec/ruby/library/socket/socket/getifaddrs_spec.rb:5:in `block (2 levels) in <top (required)>'
/export/home/rubyci/chkbuild-tmp/tmp/build/20180810T121808Z/ruby/spec/ruby/library/socket/socket/getifaddrs_spec.rb:3:in `<top (required)>'

16)
An exception occurred during: before :each
Socket.getifaddrs each returned Socket::Ifaddr has a set of flags ERROR
NotImplementedError: getifaddrs() function is unimplemented on this machine
/export/home/rubyci/chkbuild-tmp/tmp/build/20180810T121808Z/ruby/spec/ruby/library/socket/socket/getifaddrs_spec.rb:5:in `getifaddrs'
/export/home/rubyci/chkbuild-tmp/tmp/build/20180810T121808Z/ruby/spec/ruby/library/socket/socket/getifaddrs_spec.rb:5:in `block (2 levels) in <top (required)>'
/export/home/rubyci/chkbuild-tmp/tmp/build/20180810T121808Z/ruby/spec/ruby/library/socket/socket/getifaddrs_spec.rb:3:in `<top (required)>'

17)
An exception occurred during: before :each
Socket.getifaddrs the Socket::Ifaddr address is an Addrinfo ERROR
NotImplementedError: getifaddrs() function is unimplemented on this machine
/export/home/rubyci/chkbuild-tmp/tmp/build/20180810T121808Z/ruby/spec/ruby/library/socket/socket/getifaddrs_spec.rb:5:in `getifaddrs'
/export/home/rubyci/chkbuild-tmp/tmp/build/20180810T121808Z/ruby/spec/ruby/library/socket/socket/getifaddrs_spec.rb:5:in `block (2 levels) in <top (required)>'
/export/home/rubyci/chkbuild-tmp/tmp/build/20180810T121808Z/ruby/spec/ruby/library/socket/socket/getifaddrs_spec.rb:3:in `<top (required)>'

18)
An exception occurred during: before :each
Socket.getifaddrs the Socket::Ifaddr address has an address family ERROR
NotImplementedError: getifaddrs() function is unimplemented on this machine
/export/home/rubyci/chkbuild-tmp/tmp/build/20180810T121808Z/ruby/spec/ruby/library/socket/socket/getifaddrs_spec.rb:5:in `getifaddrs'
/export/home/rubyci/chkbuild-tmp/tmp/build/20180810T121808Z/ruby/spec/ruby/library/socket/socket/getifaddrs_spec.rb:5:in `block (2 levels) in <top (required)>'
/export/home/rubyci/chkbuild-tmp/tmp/build/20180810T121808Z/ruby/spec/ruby/library/socket/socket/getifaddrs_spec.rb:3:in `<top (required)>'

19)
An exception occurred during: before :each
Socket.getifaddrs the Socket::Ifaddr broadcast address is an Addrinfo ERROR
NotImplementedError: getifaddrs() function is unimplemented on this machine
/export/home/rubyci/chkbuild-tmp/tmp/build/20180810T121808Z/ruby/spec/ruby/library/socket/socket/getifaddrs_spec.rb:5:in `getifaddrs'
/export/home/rubyci/chkbuild-tmp/tmp/build/20180810T121808Z/ruby/spec/ruby/library/socket/socket/getifaddrs_spec.rb:5:in `block (2 levels) in <top (required)>'
/export/home/rubyci/chkbuild-tmp/tmp/build/20180810T121808Z/ruby/spec/ruby/library/socket/socket/getifaddrs_spec.rb:3:in `<top (required)>'

20)
An exception occurred during: before :each
Socket.getifaddrs the Socket::Ifaddr broadcast address has an address family ERROR
NotImplementedError: getifaddrs() function is unimplemented on this machine
/export/home/rubyci/chkbuild-tmp/tmp/build/20180810T121808Z/ruby/spec/ruby/library/socket/socket/getifaddrs_spec.rb:5:in `getifaddrs'
/export/home/rubyci/chkbuild-tmp/tmp/build/20180810T121808Z/ruby/spec/ruby/library/socket/socket/getifaddrs_spec.rb:5:in `block (2 levels) in <top (required)>'
/export/home/rubyci/chkbuild-tmp/tmp/build/20180810T121808Z/ruby/spec/ruby/library/socket/socket/getifaddrs_spec.rb:3:in `<top (required)>'

21)
An exception occurred during: before :each
Socket.getifaddrs the Socket::Ifaddr netmask address is an Addrinfo ERROR
NotImplementedError: getifaddrs() function is unimplemented on this machine
/export/home/rubyci/chkbuild-tmp/tmp/build/20180810T121808Z/ruby/spec/ruby/library/socket/socket/getifaddrs_spec.rb:5:in `getifaddrs'
/export/home/rubyci/chkbuild-tmp/tmp/build/20180810T121808Z/ruby/spec/ruby/library/socket/socket/getifaddrs_spec.rb:5:in `block (2 levels) in <top (required)>'
/export/home/rubyci/chkbuild-tmp/tmp/build/20180810T121808Z/ruby/spec/ruby/library/socket/socket/getifaddrs_spec.rb:3:in `<top (required)>'

22)
An exception occurred during: before :each
Socket.getifaddrs the Socket::Ifaddr netmask address has an address family ERROR
NotImplementedError: getifaddrs() function is unimplemented on this machine
/export/home/rubyci/chkbuild-tmp/tmp/build/20180810T121808Z/ruby/spec/ruby/library/socket/socket/getifaddrs_spec.rb:5:in `getifaddrs'
/export/home/rubyci/chkbuild-tmp/tmp/build/20180810T121808Z/ruby/spec/ruby/library/socket/socket/getifaddrs_spec.rb:5:in `block (2 levels) in <top (required)>'
/export/home/rubyci/chkbuild-tmp/tmp/build/20180810T121808Z/ruby/spec/ruby/library/socket/socket/getifaddrs_spec.rb:3:in `<top (required)>'

23)
An exception occurred during: before :each
Socket.getifaddrs the Socket::Ifaddr netmask address has an IP address ERROR
NotImplementedError: getifaddrs() function is unimplemented on this machine
/export/home/rubyci/chkbuild-tmp/tmp/build/20180810T121808Z/ruby/spec/ruby/library/socket/socket/getifaddrs_spec.rb:5:in `getifaddrs'
/export/home/rubyci/chkbuild-tmp/tmp/build/20180810T121808Z/ruby/spec/ruby/library/socket/socket/getifaddrs_spec.rb:5:in `block (2 levels) in <top (required)>'
/export/home/rubyci/chkbuild-tmp/tmp/build/20180810T121808Z/ruby/spec/ruby/library/socket/socket/getifaddrs_spec.rb:3:in `<top (required)>'

Finished in 172.270215 seconds

3680 files, 29440 examples, 212157 expectations, 2 failures, 21 errors, 0 tagged
gmake: *** [uncommon.mk:776: yes-test-spec] Error 1
exit 2
failed(rubyspec)

20180810T111811Z(failure) < OlderDiff < 20180810T121808Z(failure) > NewerDiff > 20180810T131808Z(failure)


chkbuild summary recent last