r64271 ruby 2.6.0dev (2018-08-10) [i386-solaris2.11] (unstable11x) 460W rubyspec:0F4E

chkbuild summary recent last

OlderDiff < 20180809T202406Z(failure) < ThisDiff > 20180810T112409Z(failure) > NewerDiff

OLDREV 64257
NEWREV 64271
CHG .gdbinit	63657->64260
CHG common.mk	64235->64270
CHG compile.c	63923->64268
CHG enumerator.c	64256->64262
CHG insns.def	64074->64268
CHG iseq.c	63734->64268
CHG mjit.c	64254->64264
CHG process.c	64254->64265
CHG ruby.c	64071->64264
CHG version.c	62558->64266
CHG version.h	64237->64259
CHG vm_core.h	64221->64268
CHG vm_insnhelper.c	64035->64268
CHG doc/maintainers.rdoc	64049->64267
CHG doc/standard_library.rdoc	64049->64267
CHG spec/ruby/core/process/groups_spec.rb	62656->64265
DEL spec/ruby/library/socket/addrinfo/foreach_spec.rb	64180->none
DEL spec/ruby/library/socket/addrinfo/getnameinfo_spec.rb	64180->none
DEL spec/ruby/library/socket/addrinfo/initialize_spec.rb	64180->none
CHG spec/ruby/library/socket/basicsocket/recvmsg_nonblock_spec.rb	64241->64258
DEL spec/ruby/library/socket/constants/constants_spec.rb	64241->none
DEL spec/ruby/library/socket/socket/getaddrinfo_spec.rb	64181->none
DEL spec/ruby/library/socket/socket/gethostbyaddr_spec.rb	64180->none
DEL spec/ruby/library/socket/socket/getnameinfo_spec.rb	64180->none
DEL spec/ruby/library/socket/socket/getservbyname_spec.rb	64180->none
DEL spec/ruby/library/socket/socket/pack_sockaddr_in_spec.rb	64180->none
DEL spec/ruby/library/socket/socket/sockaddr_in_spec.rb	64180->none
CHG test/-ext-/iseq_load/test_iseq_load.rb	63920->64271
CHG test/ruby/test_arithmetic_sequence.rb	64256->64262

===================================================================
+++ 20180810T112409Z
@@ 41 @@
 option :use_rubyspec_in_tree => true
 option :validate_dependencies => false
 == pflags # <time>
++ pflags 24200
+24200:	/home/rubyci/unstable10x/ruby_2_3/bin/ruby -I/home/rubyci/chkbuild /ho
 	data model = _ILP32  flags = ORPHAN|MSACCT|MSFORK
  /1:	flags = ASLEEP  lwp_park(0x0,0xfeffd948,0x0)
+ /2:	flags = ASLEEP  pollsys(0xfe3d3fa0,0x2,0x0,0x0)
+ /3:	flags = DETACH|ASLEEP  waitid(0x0,0x5e98,0xfda7e7b0,0x3)
 
 == process-ps # <time>
 ps -o ruser : rubyci
@@ 12018 @@
 [n/n] TestArithmeticSequence#test_first = <elapsed> s
 [n/n] TestArithmeticSequence#test_hash = <elapsed> s
 [n/n] TestArithmeticSequence#test_last = <elapsed> s
+[n/n] TestArithmeticSequence#test_last_with_float = <elapsed> s
+[n/n] TestArithmeticSequence#test_last_with_rational = <elapsed> s
 [n/n] TestArithmeticSequence#test_new = <elapsed> s
 [n/n] TestArithmeticSequence#test_next = <elapsed> s
 [n/n] TestArithmeticSequence#test_next_after_stopiteration = <elapsed> s
@@ 12287 @@
 [n/n] TestAst#test_not_cared:test/-ext-/hash/test_delete.rb = <elapsed> s
 [n/n] TestAst#test_not_cared:test/-ext-/integer/test_integer.rb = <elapsed> s
 [n/n] TestAst#test_not_cared:test/-ext-/integer/test_my_integer.rb = <elapsed> s
+[n/n] TestAst#test_not_cared:test/-ext-/iseq_load/test_iseq_load.rb/export/home/rubyci/chkbuild-tmp/tmp/build/<buildtime>/ruby/test/-ext-/iseq_load/test_iseq_load.rb:142: warning: shadowing outer local variable - f
  = <elapsed> s
 [n/n] TestAst#test_not_cared:test/-ext-/iter/test_iter_break.rb = <elapsed> s
 [n/n] TestAst#test_not_cared:test/-ext-/iter/test_yield_block.rb/export/home/rubyci/chkbuild-tmp/tmp/build/<buildtime>/ruby/test/-ext-/iter/test_yield_block.rb:19: warning: `&' interpreted as argument prefix
@@ 13340 @@
 [n/n] TestAst#test_ranges:test/-ext-/hash/test_delete.rb = <elapsed> s
 [n/n] TestAst#test_ranges:test/-ext-/integer/test_integer.rb = <elapsed> s
 [n/n] TestAst#test_ranges:test/-ext-/integer/test_my_integer.rb = <elapsed> s
+[n/n] TestAst#test_ranges:test/-ext-/iseq_load/test_iseq_load.rb/export/home/rubyci/chkbuild-tmp/tmp/build/<buildtime>/ruby/test/-ext-/iseq_load/test_iseq_load.rb:142: warning: shadowing outer local variable - f
  = <elapsed> s
 [n/n] TestAst#test_ranges:test/-ext-/iter/test_iter_break.rb = <elapsed> s
 [n/n] TestAst#test_ranges:test/-ext-/iter/test_yield_block.rb/export/home/rubyci/chkbuild-tmp/tmp/build/<buildtime>/ruby/test/-ext-/iter/test_yield_block.rb:19: warning: `&' interpreted as argument prefix
@@ 78371 @@
 Finished in <t> seconds
 
 <num> files, <num> examples, <num> expectations, <num> failures, <num> errors, <num> tagged
+gmake: *** [uncommon.mk:776: yes-test-spec] Error 1
 exit 2
 failed(rubyspec)
 == dist # <time>
@@ 78379 @@
 /home/rubyci/unstable10x/ruby_2_3/bin/ruby --disable=gems ./tool/make-snapshot \
 -srcdir=. -packages=gzip,zip,all \
 -unicode-version=10.0.0 \
+tmp trunk@64271
 Exporting trunk@<rev>
+Exported revision <rev>.
+copying ./tool/config.guess
+copying ./tool/config.sub
+copying ./.downloaded-cache/config.guess
+copying ./.downloaded-cache/config.sub
+take a breath, and go ahead
+creating configure... done
+creating prerequisites...
+gmake[1]: Entering directory '/export/home/rubyci/chkbuild-tmp/tmp/build/<buildtime>/tmp/ruby-snapshot<tmp>/ruby-<verrev>'
+tool/config.guess already exists
+tool/config.sub already exists
+Downloading bundled gem files...
+downloading did_you_mean-1.2.1.gem ... done
+downloading minitest-5.11.3.gem ... done
+downloading net-telnet-0.2.0.gem ... done
+downloading power_assert-1.1.3.gem ... done
+downloading rake-12.3.1.gem ... done
+downloading test-unit-3.2.8.gem ... done
+downloading xmlrpc-0.3.0.gem ... done
+downloading for ext/fiddle/extlibs
+downloading libffi-3.2.1.tar.gz ... done
+checking md5 of .downloaded-cache/libffi-3.2.1.tar.gz ... OK
+checking sha512 of .downloaded-cache/libffi-3.2.1.tar.gz ... OK
+mkdir -p ./enc/unicode/data/10.0.0/ucd
+touch ./enc/unicode/data/10.0.0/ucd/.unicode-tables.time ./enc/unicode/10.0.0/casefold.h ./enc/unicode/10.0.0/name2ctype.h
+mkdir -p ./enc/unicode/data/10.0.0/ucd
+touch ./enc/unicode/data/10.0.0/ucd/.unicode-tables.time ./enc/unicode/10.0.0/casefold.h ./enc/unicode/10.0.0/name2ctype.h
 generating id.h
 id.h updated
 generating opt_sc.inc
@@ 78419 @@
 generating vm.inc
 generating mjit_compile.inc
 generating node_name.inc
+./tool/node_name.rb:<line_a>: warning: flip-flop is deprecated
 generating known_errors.inc
 known_errors.inc updated
 generating vm_call_iseq_optimized.inc
+./revision.h unchanged
+mkdir -p enc/jis
 + cp enc/jis/props.h.blt enc/jis/props.h
+ruby --disable-gem ./tool/gen_dummy_probes.rb ./probes.d > probes.dmyh
 generating parse.c
 copying lex.c
 generating enc/trans/newline.c ...
@@ 78436 @@
 done.  (X.XXuser X.XXsystem X.XXelapsed)
 generating id.c
 id.c updated
+generating ext/ripper/ripper.c
+gmake[2]: Entering directory '/export/home/rubyci/chkbuild-tmp/tmp/build/<buildtime>/tmp/ruby-snapshot<tmp>/ruby-<verrev>/ext/ripper'
+extracting ripper.y from ../../parse.y
 compiling compiler ripper.y
+generating eventids1.c from ../../parse.y
+generating eventids2table.c from ./eventids2.c
+gmake[2]: Leaving directory '/export/home/rubyci/chkbuild-tmp/tmp/build/<buildtime>/tmp/ruby-snapshot<tmp>/ruby-<verrev>/ext/ripper'
+generating ext/rbconfig/sizeof/sizes.c
+gmake[2]: Entering directory '/export/home/rubyci/chkbuild-tmp/tmp/build/<buildtime>/tmp/ruby-snapshot<tmp>/ruby-<verrev>/ext/rbconfig/sizeof'
 sizes.c updated
+gmake[2]: Leaving directory '/export/home/rubyci/chkbuild-tmp/tmp/build/<buildtime>/tmp/ruby-snapshot<tmp>/ruby-<verrev>/ext/rbconfig/sizeof'
+generating ext/rbconfig/sizeof/limits.c
+gmake[2]: Entering directory '/export/home/rubyci/chkbuild-tmp/tmp/build/<buildtime>/tmp/ruby-snapshot<tmp>/ruby-<verrev>/ext/rbconfig/sizeof'
 limits.c updated
+gmake[2]: Leaving directory '/export/home/rubyci/chkbuild-tmp/tmp/build/<buildtime>/tmp/ruby-snapshot<tmp>/ruby-<verrev>/ext/rbconfig/sizeof'
+gmake[2]: Entering directory '/export/home/rubyci/chkbuild-tmp/tmp/build/<buildtime>/tmp/ruby-snapshot<tmp>/ruby-<verrev>/ext/socket'
 generating constant definitions
+gmake[2]: Leaving directory '/export/home/rubyci/chkbuild-tmp/tmp/build/<buildtime>/tmp/ruby-snapshot<tmp>/ruby-<verrev>/ext/socket'
+tool/ifchange "--timestamp=.rbconfig.time" rbconfig.rb rbconfig.tmp
 rbconfig.rb updated
 generating enc.mk
 making srcs under enc
+gmake[2]: Entering directory '/export/home/rubyci/chkbuild-tmp/tmp/build/<buildtime>/tmp/ruby-snapshot<tmp>/ruby-<verrev>'
 generating table from enc/trans/big5.c
 generating enc/trans/big5.c ...
 converter from Big5 to UTF-8
@@ 78818 @@
 converter for from_UTF_32
 converter for from_UTF_8
 done.  (X.XXuser X.XXsystem X.XXelapsed)
+gmake[2]: Leaving directory '/export/home/rubyci/chkbuild-tmp/tmp/build/<buildtime>/tmp/ruby-snapshot<tmp>/ruby-<verrev>'
 generating prelude.c
 prelude.c updated
 generating miniprelude.c
 miniprelude.c updated
+generating golf_prelude.c
+golf_prelude.c updated
+gmake[1]: Circular after-update <- prereq dependency dropped.
+downloading for ext/fiddle/extlibs
+.downloaded-cache/libffi-3.2.1.tar.gz already exists
+checking md5 of .downloaded-cache/libffi-3.2.1.tar.gz ... OK
+checking sha512 of .downloaded-cache/libffi-3.2.1.tar.gz ... OK
+extracting .downloaded-cache/libffi-3.2.1.tar.gz into ext/fiddle
+applying win32/libffi-3.2.1-mswin.patch under ext/fiddle
+patching file libffi-3.2.1/src/x86/ffi.c
+patching file libffi-3.2.1/src/x86/ffitarget.h
+patching file libffi-3.2.1/src/x86/win64.S
+patching file libffi-3.2.1/include/ffi.h.in
+Extracting bundled gem files...
+Unpacked did_you_mean-1.2.1.gem
+Unpacked minitest-5.11.3.gem
+Unpacked net-telnet-0.2.0.gem
+Unpacked power_assert-1.1.3.gem
+Unpacked rake-12.3.1.gem
+Unpacked test-unit-3.2.8.gem
+Unpacked xmlrpc-0.3.0.gem
+gmake[1]: Leaving directory '/export/home/rubyci/chkbuild-tmp/tmp/build/<buildtime>/tmp/ruby-snapshot<tmp>/ruby-<verrev>'
+prerequisites done
+creating tarball... ruby-<verrev>.tar done
+creating gzip tarball... /export/home/rubyci/chkbuild-tmp/tmp/build/<buildtime>/ruby/tmp/ruby-<verrev>.tar.gz
+7-Zip 9.20  Copyright (c) 1999-2010 Igor Pavlov  2010-11-18
+p7zip Version 9.20 (locale=C,Utf16=off,HugeFiles=on,8 CPUs)
+Scanning
 
+Creating archive stdout
 
 
+Everything is Ok
+ done
+creating zip archive... /export/home/rubyci/chkbuild-tmp/tmp/build/<buildtime>/ruby/tmp/ruby-<verrev>.zip done
+creating bzip tarball... /export/home/rubyci/chkbuild-tmp/tmp/build/<buildtime>/ruby/tmp/ruby-<verrev>.tar.bz2 done
+creating xz tarball... /export/home/rubyci/chkbuild-tmp/tmp/build/<buildtime>/ruby/tmp/ruby-<verrev>.tar.xz done
+* /export/home/rubyci/chkbuild-tmp/tmp/build/<buildtime>/ruby/tmp/ruby-<verrev>.tar.gz
+  SIZE:   <size> bytes
+  SHA1:   <digest>
+  SHA256: <digest>
+  SHA512: <digest>
+* /export/home/rubyci/chkbuild-tmp/tmp/build/<buildtime>/ruby/tmp/ruby-<verrev>.zip
+  SIZE:   <size> bytes
+  SHA1:   <digest>
+  SHA256: <digest>
+  SHA512: <digest>
+* /export/home/rubyci/chkbuild-tmp/tmp/build/<buildtime>/ruby/tmp/ruby-<verrev>.tar.bz2
+  SIZE:   <size> bytes
+  SHA1:   <digest>
+  SHA256: <digest>
+  SHA512: <digest>
+* /export/home/rubyci/chkbuild-tmp/tmp/build/<buildtime>/ruby/tmp/ruby-<verrev>.tar.xz
+  SIZE:   <size> bytes
+  SHA1:   <digest>
+  SHA256: <digest>
+  SHA512: <digest>
 == end # <time>
 <elapsed time>

===================================================================
--- 20180809T202406Z
@@ 41 @@
 option :use_rubyspec_in_tree => true
 option :validate_dependencies => false
 == pflags # <time>
-+ pflags 15197
-15197:	/home/rubyci/unstable10x/ruby_2_3/bin/ruby -I/home/rubyci/chkbuild /ho
 	data model = _ILP32  flags = ORPHAN|MSACCT|MSFORK
  /1:	flags = ASLEEP  lwp_park(0x0,0xfeffd948,0x0)
- /2:	flags = ASLEEP  pollsys(0xfe3e3fa0,0x2,0x0,0x0)
- /3:	flags = DETACH|ASLEEP  waitid(0x0,0x3b6d,0xfda8e7b0,0x3)
 
 == process-ps # <time>
 ps -o ruser : rubyci
@@ 12285 @@
 [n/n] TestAst#test_not_cared:test/-ext-/hash/test_delete.rb = <elapsed> s
 [n/n] TestAst#test_not_cared:test/-ext-/integer/test_integer.rb = <elapsed> s
 [n/n] TestAst#test_not_cared:test/-ext-/integer/test_my_integer.rb = <elapsed> s
-[n/n] TestAst#test_not_cared:test/-ext-/iseq_load/test_iseq_load.rb/export/home/rubyci/chkbuild-tmp/tmp/build/<buildtime>/ruby/test/-ext-/iseq_load/test_iseq_load.rb:124: warning: shadowing outer local variable - f
  = <elapsed> s
 [n/n] TestAst#test_not_cared:test/-ext-/iter/test_iter_break.rb = <elapsed> s
 [n/n] TestAst#test_not_cared:test/-ext-/iter/test_yield_block.rb/export/home/rubyci/chkbuild-tmp/tmp/build/<buildtime>/ruby/test/-ext-/iter/test_yield_block.rb:19: warning: `&' interpreted as argument prefix
@@ 13338 @@
 [n/n] TestAst#test_ranges:test/-ext-/hash/test_delete.rb = <elapsed> s
 [n/n] TestAst#test_ranges:test/-ext-/integer/test_integer.rb = <elapsed> s
 [n/n] TestAst#test_ranges:test/-ext-/integer/test_my_integer.rb = <elapsed> s
-[n/n] TestAst#test_ranges:test/-ext-/iseq_load/test_iseq_load.rb/export/home/rubyci/chkbuild-tmp/tmp/build/<buildtime>/ruby/test/-ext-/iseq_load/test_iseq_load.rb:124: warning: shadowing outer local variable - f
  = <elapsed> s
 [n/n] TestAst#test_ranges:test/-ext-/iter/test_iter_break.rb = <elapsed> s
 [n/n] TestAst#test_ranges:test/-ext-/iter/test_yield_block.rb/export/home/rubyci/chkbuild-tmp/tmp/build/<buildtime>/ruby/test/-ext-/iter/test_yield_block.rb:19: warning: `&' interpreted as argument prefix
@@ 70800 @@
 - raises ArgumentError if the protocol families don't match
 - raises ArgumentError if the socket types don't match
 
-/export/home/rubyci/chkbuild-tmp/tmp/build/<buildtime>/ruby/spec/ruby/library/socket/addrinfo/foreach_spec.rb
-Addrinfo.foreach
-- yields Addrinfo instances to the supplied block (ERROR - <n>)
 
 /export/home/rubyci/chkbuild-tmp/tmp/build/<buildtime>/ruby/spec/ruby/library/socket/addrinfo/getaddrinfo_spec.rb
 Addrinfo.getaddrinfo
@@ 70827 @@
 - sets the address family of the Addrinfo instances
 - sets the protocol family of the Addrinfo instances
 
-/export/home/rubyci/chkbuild-tmp/tmp/build/<buildtime>/ruby/spec/ruby/library/socket/addrinfo/getnameinfo_spec.rb
-Addrinfo#getnameinfo using an IP Addrinfo using IPv4
-- returns the node and service names (FAILED - <n>)
-- accepts flags as a Fixnum as the first argument
 
-Addrinfo#getnameinfo using an IP Addrinfo using IPv6
-- returns the node and service names (FAILED - <n>)
-- accepts flags as a Fixnum as the first argument
 
-/export/home/rubyci/chkbuild-tmp/tmp/build/<buildtime>/ruby/spec/ruby/library/socket/addrinfo/initialize_spec.rb
-Addrinfo#initialize with a sockaddr string without a family
-- stores the ip address from the sockaddr
-- stores the port number from the sockaddr
-- returns the Socket::UNSPEC pfamily
-- returns AF_INET as the default address family
-- returns the INET6 afamily
-- returns the 0 socket type
-- returns the 0 protocol
 
-Addrinfo#initialize with a sockaddr string with a family given
-- stores the ip address from the sockaddr
-- stores the port number from the sockaddr
-- returns the Socket::UNSPEC pfamily
-- returns the INET6 afamily
-- returns the 0 socket type
-- returns the 0 protocol
 
-Addrinfo#initialize with a sockaddr string with a family and socket type
-- stores the ip address from the sockaddr
-- stores the port number from the sockaddr
-- returns the Socket::UNSPEC pfamily
-- returns the INET6 afamily
-- returns the 0 socket type
-- returns the 0 protocol
 
-Addrinfo#initialize with a sockaddr string with a family, socket type and protocol
-- stores the ip address from the sockaddr
-- stores the port number from the sockaddr
-- returns the Socket::UNSPEC pfamily
-- returns the INET6 afamily
-- returns the specified socket type
-- returns the specified protocol
 
-Addrinfo#initialize with a sockaddr array without a family
-- stores the ip address from the sockaddr
-- stores the port number from the sockaddr
-- returns the Socket::PF_INET pfamily
-- returns the INET6 afamily
-- returns the 0 socket type
-- returns the 0 protocol
 
-Addrinfo#initialize with a sockaddr array with a valid IP address
-- returns an Addrinfo with the correct IP
-- returns an Addrinfo with the correct address family
-- returns an Addrinfo with the correct protocol family
-- returns an Addrinfo with the correct port
 
-Addrinfo#initialize with a sockaddr array with an invalid IP address
 - raises SocketError
 
-Addrinfo#initialize with a sockaddr array with a family given
-- stores the ip address from the sockaddr
-- stores the port number from the sockaddr
-- returns the Socket::UNSPEC pfamily
-- returns the INET6 afamily
-- returns the 0 socket type
-- returns the 0 protocol
 
-Addrinfo#initialize with a sockaddr array with a family and socket type
-- stores the ip address from the sockaddr
-- stores the port number from the sockaddr
-- returns the Socket::UNSPEC pfamily
-- returns the INET6 afamily
-- returns the 0 socket type
-- returns the 0 protocol
-- overwrites the socket type SOCK_STREAM
-- overwrites the socket type SOCK_DGRAM
-- overwrites the socket type SOCK_RAW
-- raises SocketError when using SOCK_RDM
 
-Addrinfo#initialize with a sockaddr array with a family, socket type and protocol
-- stores the ip address from the sockaddr
-- stores the port number from the sockaddr
-- returns the Socket::UNSPEC pfamily
-- returns the INET6 afamily
-- returns the 0 socket type
-- returns the specified protocol
 
-Addrinfo#initialize using an Array with extra arguments with the AF_INET6 address family and an explicit protocol family
-- raises SocketError when using any Socket constant except except AF_INET(6)/PF_INET(6)
 
-Addrinfo#initialize using an Array with extra arguments with the AF_INET address family and an explicit socket protocol and no socket type is given
-- overwrites the protocol when using IPPROTO_IP
-- overwrites the protocol when using IPPROTO_UDP
-- overwrites the protocol when using IPPROTO_HOPOPTS
-- raises SocketError when using IPPROTO_ICMP (FAILED - <n>)
-- raises SocketError when using IPPROTO_IGMP (FAILED - <n>)
-- raises SocketError when using IPPROTO_GGP (FAILED - <n>)
-- raises SocketError when using IPPROTO_TCP (FAILED - <n>)
-- raises SocketError when using IPPROTO_EGP (FAILED - <n>)
-- raises SocketError when using IPPROTO_PUP (FAILED - <n>)
-- raises SocketError when using IPPROTO_IDP (FAILED - <n>)
-- raises SocketError when using IPPROTO_HELLO (FAILED - <n>)
-- raises SocketError when using IPPROTO_ND (FAILED - <n>)
-- raises SocketError when using IPPROTO_EON (FAILED - <n>)
-- raises SocketError when using IPPROTO_AH (FAILED - <n>)
-- raises SocketError when using IPPROTO_DSTOPTS (FAILED - <n>)
-- raises SocketError when using IPPROTO_ESP (FAILED - <n>)
-- raises SocketError when using IPPROTO_FRAGMENT (FAILED - <n>)
-- raises SocketError when using IPPROTO_ICMPV6 (FAILED - <n>)
-- raises SocketError when using IPPROTO_IPV6 (FAILED - <n>)
-- raises SocketError when using IPPROTO_NONE (FAILED - <n>)
-- raises SocketError when using IPPROTO_ROUTING (FAILED - <n>)
-- raises SocketError when using IPPROTO_RAW (FAILED - <n>)
-- raises SocketError when using IPPROTO_MAX (FAILED - <n>)
 
-Addrinfo#initialize using an Array with extra arguments with the AF_INET address family and an explicit socket protocol and the socket type is set to SOCK_DGRAM
-- overwrites the protocol when using IPPROTO_IP
-- overwrites the protocol when using IPPROTO_UDP
-- overwrites the protocol when using IPPROTO_HOPOPTS
-- raises SocketError when using IPPROTO_ICMP (FAILED - <n>)
-- raises SocketError when using IPPROTO_IGMP (FAILED - <n>)
-- raises SocketError when using IPPROTO_GGP (FAILED - <n>)
-- raises SocketError when using IPPROTO_TCP (FAILED - <n>)
-- raises SocketError when using IPPROTO_EGP (FAILED - <n>)
-- raises SocketError when using IPPROTO_PUP (FAILED - <n>)
-- raises SocketError when using IPPROTO_IDP (FAILED - <n>)
-- raises SocketError when using IPPROTO_HELLO (FAILED - <n>)
-- raises SocketError when using IPPROTO_ND (FAILED - <n>)
-- raises SocketError when using IPPROTO_EON (FAILED - <n>)
-- raises SocketError when using IPPROTO_AH (FAILED - <n>)
-- raises SocketError when using IPPROTO_DSTOPTS (FAILED - <n>)
-- raises SocketError when using IPPROTO_ESP (FAILED - <n>)
-- raises SocketError when using IPPROTO_FRAGMENT (FAILED - <n>)
-- raises SocketError when using IPPROTO_ICMPV6 (FAILED - <n>)
-- raises SocketError when using IPPROTO_IPV6 (FAILED - <n>)
-- raises SocketError when using IPPROTO_NONE (FAILED - <n>)
-- raises SocketError when using IPPROTO_ROUTING (FAILED - <n>)
-- raises SocketError when using IPPROTO_RAW (FAILED - <n>)
-- raises SocketError when using IPPROTO_MAX (FAILED - <n>)
 
-Addrinfo#initialize using an Array with extra arguments with the AF_INET address family and an explicit socket protocol and the socket type is set to SOCK_RAW
-- overwrites the protocol when using IPPROTO_IP
-- overwrites the protocol when using IPPROTO_ICMP
-- overwrites the protocol when using IPPROTO_IGMP
-- overwrites the protocol when using IPPROTO_GGP
-- overwrites the protocol when using IPPROTO_TCP
-- overwrites the protocol when using IPPROTO_EGP
-- overwrites the protocol when using IPPROTO_PUP
-- overwrites the protocol when using IPPROTO_UDP
-- overwrites the protocol when using IPPROTO_IDP
-- overwrites the protocol when using IPPROTO_HELLO
-- overwrites the protocol when using IPPROTO_ND
-- overwrites the protocol when using IPPROTO_EON
-- overwrites the protocol when using IPPROTO_AH
-- overwrites the protocol when using IPPROTO_DSTOPTS
-- overwrites the protocol when using IPPROTO_ESP
-- overwrites the protocol when using IPPROTO_FRAGMENT
-- overwrites the protocol when using IPPROTO_HOPOPTS
-- overwrites the protocol when using IPPROTO_ICMPV6
-- overwrites the protocol when using IPPROTO_IPV6
-- overwrites the protocol when using IPPROTO_NONE
-- overwrites the protocol when using IPPROTO_ROUTING
-- overwrites the protocol when using IPPROTO_RAW
-- overwrites the protocol when using IPPROTO_MAX
 
-Addrinfo#initialize using an Array with extra arguments with the AF_INET address family and an explicit socket protocol and the socket type is set to SOCK_RDM
-- raises SocketError when using IPPROTO_IP
-- raises SocketError when using IPPROTO_ICMP
-- raises SocketError when using IPPROTO_IGMP
-- raises SocketError when using IPPROTO_GGP
-- raises SocketError when using IPPROTO_TCP
-- raises SocketError when using IPPROTO_EGP
-- raises SocketError when using IPPROTO_PUP
-- raises SocketError when using IPPROTO_UDP
-- raises SocketError when using IPPROTO_IDP
-- raises SocketError when using IPPROTO_HELLO
-- raises SocketError when using IPPROTO_ND
-- raises SocketError when using IPPROTO_EON
-- raises SocketError when using IPPROTO_AH
-- raises SocketError when using IPPROTO_DSTOPTS
-- raises SocketError when using IPPROTO_ESP
-- raises SocketError when using IPPROTO_FRAGMENT
-- raises SocketError when using IPPROTO_HOPOPTS
-- raises SocketError when using IPPROTO_ICMPV6
-- raises SocketError when using IPPROTO_IPV6
-- raises SocketError when using IPPROTO_NONE
-- raises SocketError when using IPPROTO_ROUTING
-- raises SocketError when using IPPROTO_RAW
-- raises SocketError when using IPPROTO_MAX
 
-Addrinfo#initialize using an Array with extra arguments with the AF_INET address family and an explicit socket protocol and the socket type is set to SOCK_SEQPACKET
-- overwrites the protocol when using IPPROTO_IP
-- overwrites the protocol when using IPPROTO_HOPOPTS
-- raises SocketError when using IPPROTO_ICMP (FAILED - <n>)
-- raises SocketError when using IPPROTO_IGMP (FAILED - <n>)
-- raises SocketError when using IPPROTO_GGP (FAILED - <n>)
-- raises SocketError when using IPPROTO_TCP (FAILED - <n>)
-- raises SocketError when using IPPROTO_EGP (FAILED - <n>)
-- raises SocketError when using IPPROTO_PUP (FAILED - <n>)
-- raises SocketError when using IPPROTO_UDP (FAILED - <n>)
-- raises SocketError when using IPPROTO_IDP (FAILED - <n>)
-- raises SocketError when using IPPROTO_HELLO (FAILED - <n>)
-- raises SocketError when using IPPROTO_ND (FAILED - <n>)
-- raises SocketError when using IPPROTO_EON (FAILED - <n>)
-- raises SocketError when using IPPROTO_AH (FAILED - <n>)
-- raises SocketError when using IPPROTO_DSTOPTS (FAILED - <n>)
-- raises SocketError when using IPPROTO_ESP (FAILED - <n>)
-- raises SocketError when using IPPROTO_FRAGMENT (FAILED - <n>)
-- raises SocketError when using IPPROTO_ICMPV6 (FAILED - <n>)
-- raises SocketError when using IPPROTO_IPV6 (FAILED - <n>)
-- raises SocketError when using IPPROTO_NONE (FAILED - <n>)
-- raises SocketError when using IPPROTO_ROUTING (FAILED - <n>)
-- raises SocketError when using IPPROTO_RAW (FAILED - <n>)
-- raises SocketError when using IPPROTO_MAX (FAILED - <n>)
 
-Addrinfo#initialize using an Array with extra arguments with the AF_INET address family and an explicit socket protocol and the socket type is set to SOCK_STREAM
-- overwrites the protocol when using IPPROTO_IP
-- overwrites the protocol when using IPPROTO_TCP
-- overwrites the protocol when using IPPROTO_HOPOPTS
-- raises SocketError when using IPPROTO_ICMP (FAILED - <n>)
-- raises SocketError when using IPPROTO_IGMP (FAILED - <n>)
-- raises SocketError when using IPPROTO_GGP (FAILED - <n>)
-- raises SocketError when using IPPROTO_EGP (FAILED - <n>)
-- raises SocketError when using IPPROTO_PUP (FAILED - <n>)
-- raises SocketError when using IPPROTO_UDP (FAILED - <n>)
-- raises SocketError when using IPPROTO_IDP (FAILED - <n>)
-- raises SocketError when using IPPROTO_HELLO (FAILED - <n>)
-- raises SocketError when using IPPROTO_ND (FAILED - <n>)
-- raises SocketError when using IPPROTO_EON (FAILED - <n>)
-- raises SocketError when using IPPROTO_AH (FAILED - <n>)
-- raises SocketError when using IPPROTO_DSTOPTS (FAILED - <n>)
-- raises SocketError when using IPPROTO_ESP (FAILED - <n>)
-- raises SocketError when using IPPROTO_FRAGMENT (FAILED - <n>)
-- raises SocketError when using IPPROTO_ICMPV6 (FAILED - <n>)
-- raises SocketError when using IPPROTO_IPV6 (FAILED - <n>)
-- raises SocketError when using IPPROTO_NONE (FAILED - <n>)
-- raises SocketError when using IPPROTO_ROUTING (FAILED - <n>)
-- raises SocketError when using IPPROTO_RAW (FAILED - <n>)
-- raises SocketError when using IPPROTO_MAX (FAILED - <n>)
 
-Addrinfo#initialize with Symbols
-- returns an Addrinfo with :PF_INET  family
-- returns an Addrinfo with :INET  family
-- returns an Addrinfo with :SOCK_STREAM as the socket type
-- returns an Addrinfo with :STREAM as the socket type
 
-Addrinfo#initialize with Strings
-- returns an Addrinfo with "PF_INET"  family
-- returns an Addrinfo with "INET"  family
-- returns an Addrinfo with "SOCK_STREAM" as the socket type
-- returns an Addrinfo with "STREAM" as the socket type
 
-Addrinfo#initialize using separate arguments for a Unix socket
-- returns an Addrinfo with the correct unix path
-- returns an Addrinfo with the correct protocol family
-- returns an Addrinfo with the correct address family
 
 /export/home/rubyci/chkbuild-tmp/tmp/build/<buildtime>/ruby/spec/ruby/library/socket/addrinfo/inspect_sockaddr_spec.rb
 Addrinfo#inspect_sockaddr using an IPv4 address
@@ 72254 @@
 Socket::BasicSocket#shutdown using IPv6 using an object that does not respond to #to_str
 - raises TypeError
 
-/export/home/rubyci/chkbuild-tmp/tmp/build/<buildtime>/ruby/spec/ruby/library/socket/constants/constants_spec.rb
-Socket::Constants
-- defines socket types
-- defines protocol families
-- defines PF_IPX protocol
-- defines address families
-- defines AF_IPX address
-- defines send/receive options
-- defines socket level options
-- defines socket options
-- defines multicast options
-- defines TCP options
-- defines SCM options (FAILED - <n>)
-- defines error options
 
 /export/home/rubyci/chkbuild-tmp/tmp/build/<buildtime>/ruby/spec/ruby/library/socket/ipsocket/addr_spec.rb
 Socket::IPSocket#addr
@@ 72461 @@
 - uses AF_INET as the address family
 - uses PF_INET as the protocol family
 - uses SOCK_STREAM as the socket type
-- uses 0 as the protocol (ERROR - <n>)
 - uses the same IP address as the client Socket
 - uses the same port as the client Socket
 
@@ 72595 @@
 Socket.for_fd
 - creates a new Socket that aliases the existing Socket's file descriptor
 
-/export/home/rubyci/chkbuild-tmp/tmp/build/<buildtime>/ruby/spec/ruby/library/socket/socket/getaddrinfo_spec.rb
-Socket.getaddrinfo without global reverse lookups
-- returns an Array (ERROR - <n>)
-- accepts a Fixnum as the address family (ERROR - <n>)
-- accepts a Fixnum as the address family using IPv6 (ERROR - <n>)
-- accepts a Symbol as the address family (ERROR - <n>)
-- accepts a Symbol as the address family using IPv6 (ERROR - <n>)
-- accepts a String as the address family (ERROR - <n>)
-- accepts a String as the address family using IPv6 (ERROR - <n>)
-- accepts an object responding to #to_str as the host (ERROR - <n>)
-- accepts an object responding to #to_str as the address family (ERROR - <n>)
-- accepts a Fixnum as the socket type (ERROR - <n>)
-- accepts a Symbol as the socket type (ERROR - <n>)
-- accepts a String as the socket type (ERROR - <n>)
-- accepts an object responding to #to_str as the socket type (ERROR - <n>)
-- accepts a Fixnum as the protocol family
-- accepts a Fixnum as the flags (ERROR - <n>)
-- performs a reverse lookup when the reverse_lookup argument is true (ERROR - <n>)
-- performs a reverse lookup when the reverse_lookup argument is :hostname (ERROR - <n>)
-- performs a reverse lookup when the reverse_lookup argument is :numeric (ERROR - <n>)
 
-Socket.getaddrinfo with global reverse lookups
-- returns an address honoring the global lookup option (ERROR - <n>)
 
-/export/home/rubyci/chkbuild-tmp/tmp/build/<buildtime>/ruby/spec/ruby/library/socket/socket/gethostbyaddr_spec.rb
-Socket.gethostbyaddr using an IPv4 address without an explicit address family
 - returns an Array
 
-Socket.gethostbyaddr using an IPv4 address without an explicit address family the returned Array
-- includes the hostname as the first value (FAILED - <n>)
 - includes the aliases as the 2nd value
 - includes the address type as the 3rd value
-- includes all address strings as the remaining values
 
-Socket.gethostbyaddr using an IPv4 address with an explicit address family
-- returns an Array when using a Fixnum as the address family
-- returns an Array when using a Symbol as the address family
-- raises SocketError when the address is not supported by the family
 
-Socket.gethostbyaddr using an IPv6 address without an explicit address family
 - returns an Array
 
-Socket.gethostbyaddr using an IPv6 address without an explicit address family the returned Array
 - includes the hostname as the first value
 - includes the aliases as the 2nd value
 - includes the address type as the 3rd value
-- includes all address strings as the remaining values
 
-Socket.gethostbyaddr using an IPv6 address with an explicit address family
-- returns an Array when using a Fixnum as the address family
-- returns an Array when using a Symbol as the address family
-- raises SocketError when the address is not supported by the family
 
 /export/home/rubyci/chkbuild-tmp/tmp/build/<buildtime>/ruby/spec/ruby/library/socket/socket/gethostbyname_spec.rb
 Socket#gethostbyname
@@ 72712 @@
 - has an address family
 - has an IP address
 
-/export/home/rubyci/chkbuild-tmp/tmp/build/<buildtime>/ruby/spec/ruby/library/socket/socket/getnameinfo_spec.rb
-Socket.getnameinfo
-- gets the name information and don't resolve it
-- gets the name information and resolve the host
-- gets the name information and resolves the service
-- gets a 3-element array and doesn't resolve hostname
-- gets a 3-element array and resolves the service
-- gets a 4-element array and doesn't resolve hostname
-- gets a 4-element array and resolves the service
 
-Socket.getnameinfo using a String as the first argument
-- raises SocketError when using an invalid String
 
-Socket.getnameinfo using a String as the first argument without custom flags
-- returns an Array containing the hostname and service name (FAILED - <n>)
 
-Socket.getnameinfo using a String as the first argument using NI_NUMERICHOST as the flag
-- returns an Array containing the numeric hostname and service name (FAILED - <n>)
 
-Socket.getnameinfo using IPv4 using a 3 element Array as the first argument
-- raises ArgumentError when using an invalid Array
 
-Socket.getnameinfo using IPv4 using a 3 element Array as the first argument without custom flags
-- returns an Array containing the hostname and service name (FAILED - <n>)
 
-Socket.getnameinfo using IPv4 using a 3 element Array as the first argument using NI_NUMERICHOST as the flag
-- returns an Array containing the numeric hostname and service name (FAILED - <n>)
 
-Socket.getnameinfo using IPv4 using a 4 element Array as the first argument without custom flags
-- returns an Array containing the hostname and service name (FAILED - <n>)
-- uses the 3rd value as the hostname if the 4th is not present (FAILED - <n>)
 
-Socket.getnameinfo using IPv4 using a 4 element Array as the first argument using NI_NUMERICHOST as the flag
-- returns an Array containing the numeric hostname and service name (FAILED - <n>)
 
-Socket.getnameinfo using IPv6 using a 3 element Array as the first argument
-- raises ArgumentError when using an invalid Array
 
-Socket.getnameinfo using IPv6 using a 3 element Array as the first argument without custom flags
-- returns an Array containing the hostname and service name (FAILED - <n>)
 
-Socket.getnameinfo using IPv6 using a 3 element Array as the first argument using NI_NUMERICHOST as the flag
-- returns an Array containing the numeric hostname and service name (FAILED - <n>)
 
-Socket.getnameinfo using IPv6 using a 4 element Array as the first argument without custom flags
-- returns an Array containing the hostname and service name (FAILED - <n>)
-- uses the 3rd value as the hostname if the 4th is not present (FAILED - <n>)
 
-Socket.getnameinfo using IPv6 using a 4 element Array as the first argument using NI_NUMERICHOST as the flag
-- returns an Array containing the numeric hostname and service name (FAILED - <n>)
 
-/export/home/rubyci/chkbuild-tmp/tmp/build/<buildtime>/ruby/spec/ruby/library/socket/socket/getservbyname_spec.rb
-Socket#getservbyname
-- returns the port for service 'discard'
-- returns the port for service 'discard' with protocol 'tcp'
-- returns the port for service "http" (ERROR - <n>)
-- returns the port for service "http" with protocol "tcp" (ERROR - <n>)
-- returns the port for service 'domain' with protocol 'udp'
-- returns the port for service 'daytime'
-- raises a SocketError when the service or port is invalid
 
 /export/home/rubyci/chkbuild-tmp/tmp/build/<buildtime>/ruby/spec/ruby/library/socket/socket/getservbyport_spec.rb
 Socket.getservbyport
@@ 72850 @@
 - uses 0 as the protocol
 
 /export/home/rubyci/chkbuild-tmp/tmp/build/<buildtime>/ruby/spec/ruby/library/socket/socket/new_spec.rb
-/export/home/rubyci/chkbuild-tmp/tmp/build/<buildtime>/ruby/spec/ruby/library/socket/socket/pack_sockaddr_in_spec.rb
-Socket#pack_sockaddr_in
 - packs and unpacks
 
-Socket#pack_sockaddr_in using an IPv4 address
-- returns a String of 16 bytes
 
-Socket#pack_sockaddr_in using an IPv6 address
-- returns a String of 28 bytes (FAILED - <n>)
 
 /export/home/rubyci/chkbuild-tmp/tmp/build/<buildtime>/ruby/spec/ruby/library/socket/socket/pack_sockaddr_un_spec.rb
 Socket#pack_sockaddr_un
@@ 73008 @@
 - uses the correct port
 - uses 0 as the protocol
 
-/export/home/rubyci/chkbuild-tmp/tmp/build/<buildtime>/ruby/spec/ruby/library/socket/socket/sockaddr_in_spec.rb
-Socket#sockaddr_in
 - packs and unpacks
 
-Socket#sockaddr_in using an IPv4 address
-- returns a String of 16 bytes
 
-Socket#sockaddr_in using an IPv6 address
-- returns a String of 28 bytes (FAILED - <n>)
 
 /export/home/rubyci/chkbuild-tmp/tmp/build/<buildtime>/ruby/spec/ruby/library/socket/socket/sockaddr_un_spec.rb
 Socket#sockaddr_un
@@ 78750 @@
 
 
  <n>)
-Addrinfo.foreach yields Addrinfo instances to the supplied block ERROR
 SocketError: getaddrinfo: node name or service name not known
-/export/home/rubyci/chkbuild-tmp/tmp/build/<buildtime>/ruby/.ext/common/socket.rb:<line_a>:in `getaddrinfo'
-/export/home/rubyci/chkbuild-tmp/tmp/build/<buildtime>/ruby/.ext/common/socket.rb:<line_a>:in `foreach'
-/export/home/rubyci/chkbuild-tmp/tmp/build/<buildtime>/ruby/spec/ruby/library/socket/addrinfo/foreach_spec.rb:<line_a>:in `block (2 levels) in <top (required)>'
-/export/home/rubyci/chkbuild-tmp/tmp/build/<buildtime>/ruby/spec/ruby/library/socket/addrinfo/foreach_spec.rb:<line_a>:in `<top (required)>'
 
  <n>)
 Addrinfo.getaddrinfo returns an Array of Addrinfo instances ERROR
@@ 78786 @@
 /export/home/rubyci/chkbuild-tmp/tmp/build/<buildtime>/ruby/spec/ruby/library/socket/addrinfo/getaddrinfo_spec.rb:<line_a>:in `<top (required)>'
 
  <n>)
-Addrinfo#getnameinfo using an IP Addrinfo using IPv4 returns the node and service names FAILED
-Expected "80"
- to equal "http"
 
-/export/home/rubyci/chkbuild-tmp/tmp/build/<buildtime>/ruby/spec/ruby/library/socket/addrinfo/getnameinfo_spec.rb:<line_a>:in `block (4 levels) in <top (required)>'
-/export/home/rubyci/chkbuild-tmp/tmp/build/<buildtime>/ruby/spec/ruby/library/socket/addrinfo/getnameinfo_spec.rb:<line_a>:in `<top (required)>'
 
  <n>)
-Addrinfo#getnameinfo using an IP Addrinfo using IPv6 returns the node and service names FAILED
-Expected "80"
- to equal "http"
 
-/export/home/rubyci/chkbuild-tmp/tmp/build/<buildtime>/ruby/spec/ruby/library/socket/addrinfo/getnameinfo_spec.rb:<line_a>:in `block (4 levels) in <top (required)>'
-/export/home/rubyci/chkbuild-tmp/tmp/build/<buildtime>/ruby/spec/ruby/library/socket/addrinfo/getnameinfo_spec.rb:<line_a>:in `<top (required)>'
 
  <n>)
-Addrinfo#initialize using an Array with extra arguments with the AF_INET address family and an explicit socket protocol and no socket type is given raises SocketError when using IPPROTO_ICMP FAILED
-Expected SocketError
-but no exception was raised (#<Addrinfo: 127.0.0.1:80 IPPROTO_ICMP (hostname)> was returned)
-/export/home/rubyci/chkbuild-tmp/tmp/build/<buildtime>/ruby/spec/ruby/library/socket/addrinfo/initialize_spec.rb:<line_a>:in `block (7 levels) in <top (required)>'
-/export/home/rubyci/chkbuild-tmp/tmp/build/<buildtime>/ruby/spec/ruby/library/socket/addrinfo/initialize_spec.rb:<line_a>:in `<top (required)>'
 
  <n>)
-Addrinfo#initialize using an Array with extra arguments with the AF_INET address family and an explicit socket protocol and no socket type is given raises SocketError when using IPPROTO_IGMP FAILED
-Expected SocketError
-but no exception was raised (#<Addrinfo: 127.0.0.1:80 IPPROTO_IGMP (hostname)> was returned)
-/export/home/rubyci/chkbuild-tmp/tmp/build/<buildtime>/ruby/spec/ruby/library/socket/addrinfo/initialize_spec.rb:<line_a>:in `block (7 levels) in <top (required)>'
-/export/home/rubyci/chkbuild-tmp/tmp/build/<buildtime>/ruby/spec/ruby/library/socket/addrinfo/initialize_spec.rb:<line_a>:in `<top (required)>'
 
  <n>)
-Addrinfo#initialize using an Array with extra arguments with the AF_INET address family and an explicit socket protocol and no socket type is given raises SocketError when using IPPROTO_GGP FAILED
-Expected SocketError
-but no exception was raised (#<Addrinfo: 127.0.0.1:80 IPPROTO_GGP (hostname)> was returned)
-/export/home/rubyci/chkbuild-tmp/tmp/build/<buildtime>/ruby/spec/ruby/library/socket/addrinfo/initialize_spec.rb:<line_a>:in `block (7 levels) in <top (required)>'
-/export/home/rubyci/chkbuild-tmp/tmp/build/<buildtime>/ruby/spec/ruby/library/socket/addrinfo/initialize_spec.rb:<line_a>:in `<top (required)>'
 
  <n>)
-Addrinfo#initialize using an Array with extra arguments with the AF_INET address family and an explicit socket protocol and no socket type is given raises SocketError when using IPPROTO_TCP FAILED
-Expected SocketError
-but no exception was raised (#<Addrinfo: 127.0.0.1:80 IPPROTO_TCP (hostname)> was returned)
-/export/home/rubyci/chkbuild-tmp/tmp/build/<buildtime>/ruby/spec/ruby/library/socket/addrinfo/initialize_spec.rb:<line_a>:in `block (7 levels) in <top (required)>'
-/export/home/rubyci/chkbuild-tmp/tmp/build/<buildtime>/ruby/spec/ruby/library/socket/addrinfo/initialize_spec.rb:<line_a>:in `<top (required)>'
 
  <n>)
-Addrinfo#initialize using an Array with extra arguments with the AF_INET address family and an explicit socket protocol and no socket type is given raises SocketError when using IPPROTO_EGP FAILED
-Expected SocketError
-but no exception was raised (#<Addrinfo: 127.0.0.1:80 IPPROTO_EGP (hostname)> was returned)
-/export/home/rubyci/chkbuild-tmp/tmp/build/<buildtime>/ruby/spec/ruby/library/socket/addrinfo/initialize_spec.rb:<line_a>:in `block (7 levels) in <top (required)>'
-/export/home/rubyci/chkbuild-tmp/tmp/build/<buildtime>/ruby/spec/ruby/library/socket/addrinfo/initialize_spec.rb:<line_a>:in `<top (required)>'
 
  <n>)
-Addrinfo#initialize using an Array with extra arguments with the AF_INET address family and an explicit socket protocol and no socket type is given raises SocketError when using IPPROTO_PUP FAILED
-Expected SocketError
-but no exception was raised (#<Addrinfo: 127.0.0.1:80 IPPROTO_PUP (hostname)> was returned)
-/export/home/rubyci/chkbuild-tmp/tmp/build/<buildtime>/ruby/spec/ruby/library/socket/addrinfo/initialize_spec.rb:<line_a>:in `block (7 levels) in <top (required)>'
-/export/home/rubyci/chkbuild-tmp/tmp/build/<buildtime>/ruby/spec/ruby/library/socket/addrinfo/initialize_spec.rb:<line_a>:in `<top (required)>'
 
  <n>)
-Addrinfo#initialize using an Array with extra arguments with the AF_INET address family and an explicit socket protocol and no socket type is given raises SocketError when using IPPROTO_IDP FAILED
-Expected SocketError
-but no exception was raised (#<Addrinfo: 127.0.0.1:80 IPPROTO_IDP (hostname)> was returned)
-/export/home/rubyci/chkbuild-tmp/tmp/build/<buildtime>/ruby/spec/ruby/library/socket/addrinfo/initialize_spec.rb:<line_a>:in `block (7 levels) in <top (required)>'
-/export/home/rubyci/chkbuild-tmp/tmp/build/<buildtime>/ruby/spec/ruby/library/socket/addrinfo/initialize_spec.rb:<line_a>:in `<top (required)>'
 
  <n>)
-Addrinfo#initialize using an Array with extra arguments with the AF_INET address family and an explicit socket protocol and no socket type is given raises SocketError when using IPPROTO_HELLO FAILED
-Expected SocketError
-but no exception was raised (#<Addrinfo: 127.0.0.1:80 IPPROTO_HELLO (hostname)> was returned)
-/export/home/rubyci/chkbuild-tmp/tmp/build/<buildtime>/ruby/spec/ruby/library/socket/addrinfo/initialize_spec.rb:<line_a>:in `block (7 levels) in <top (required)>'
-/export/home/rubyci/chkbuild-tmp/tmp/build/<buildtime>/ruby/spec/ruby/library/socket/addrinfo/initialize_spec.rb:<line_a>:in `<top (required)>'
 
  <n>)
-Addrinfo#initialize using an Array with extra arguments with the AF_INET address family and an explicit socket protocol and no socket type is given raises SocketError when using IPPROTO_ND FAILED
-Expected SocketError
-but no exception was raised (#<Addrinfo: 127.0.0.1:80 IPPROTO_ND (hostname)> was returned)
-/export/home/rubyci/chkbuild-tmp/tmp/build/<buildtime>/ruby/spec/ruby/library/socket/addrinfo/initialize_spec.rb:<line_a>:in `block (7 levels) in <top (required)>'
-/export/home/rubyci/chkbuild-tmp/tmp/build/<buildtime>/ruby/spec/ruby/library/socket/addrinfo/initialize_spec.rb:<line_a>:in `<top (required)>'
 
  <n>)
-Addrinfo#initialize using an Array with extra arguments with the AF_INET address family and an explicit socket protocol and no socket type is given raises SocketError when using IPPROTO_EON FAILED
-Expected SocketError
-but no exception was raised (#<Addrinfo: 127.0.0.1:80 IPPROTO_EON (hostname)> was returned)
-/export/home/rubyci/chkbuild-tmp/tmp/build/<buildtime>/ruby/spec/ruby/library/socket/addrinfo/initialize_spec.rb:<line_a>:in `block (7 levels) in <top (required)>'
-/export/home/rubyci/chkbuild-tmp/tmp/build/<buildtime>/ruby/spec/ruby/library/socket/addrinfo/initialize_spec.rb:<line_a>:in `<top (required)>'
 
  <n>)
-Addrinfo#initialize using an Array with extra arguments with the AF_INET address family and an explicit socket protocol and no socket type is given raises SocketError when using IPPROTO_AH FAILED
-Expected SocketError
-but no exception was raised (#<Addrinfo: 127.0.0.1:80 IPPROTO_AH (hostname)> was returned)
-/export/home/rubyci/chkbuild-tmp/tmp/build/<buildtime>/ruby/spec/ruby/library/socket/addrinfo/initialize_spec.rb:<line_a>:in `block (7 levels) in <top (required)>'
-/export/home/rubyci/chkbuild-tmp/tmp/build/<buildtime>/ruby/spec/ruby/library/socket/addrinfo/initialize_spec.rb:<line_a>:in `<top (required)>'
 
  <n>)
-Addrinfo#initialize using an Array with extra arguments with the AF_INET address family and an explicit socket protocol and no socket type is given raises SocketError when using IPPROTO_DSTOPTS FAILED
-Expected SocketError
-but no exception was raised (#<Addrinfo: 127.0.0.1:80 IPPROTO_DSTOPTS (hostname)> was returned)
-/export/home/rubyci/chkbuild-tmp/tmp/build/<buildtime>/ruby/spec/ruby/library/socket/addrinfo/initialize_spec.rb:<line_a>:in `block (7 levels) in <top (required)>'
-/export/home/rubyci/chkbuild-tmp/tmp/build/<buildtime>/ruby/spec/ruby/library/socket/addrinfo/initialize_spec.rb:<line_a>:in `<top (required)>'
 
  <n>)
-Addrinfo#initialize using an Array with extra arguments with the AF_INET address family and an explicit socket protocol and no socket type is given raises SocketError when using IPPROTO_ESP FAILED
-Expected SocketError
-but no exception was raised (#<Addrinfo: 127.0.0.1:80 IPPROTO_ESP (hostname)> was returned)
-/export/home/rubyci/chkbuild-tmp/tmp/build/<buildtime>/ruby/spec/ruby/library/socket/addrinfo/initialize_spec.rb:<line_a>:in `block (7 levels) in <top (required)>'
-/export/home/rubyci/chkbuild-tmp/tmp/build/<buildtime>/ruby/spec/ruby/library/socket/addrinfo/initialize_spec.rb:<line_a>:in `<top (required)>'
 
  <n>)
-Addrinfo#initialize using an Array with extra arguments with the AF_INET address family and an explicit socket protocol and no socket type is given raises SocketError when using IPPROTO_FRAGMENT FAILED
-Expected SocketError
-but no exception was raised (#<Addrinfo: 127.0.0.1:80 IPPROTO_FRAGMENT (hostname)> was returned)
-/export/home/rubyci/chkbuild-tmp/tmp/build/<buildtime>/ruby/spec/ruby/library/socket/addrinfo/initialize_spec.rb:<line_a>:in `block (7 levels) in <top (required)>'
-/export/home/rubyci/chkbuild-tmp/tmp/build/<buildtime>/ruby/spec/ruby/library/socket/addrinfo/initialize_spec.rb:<line_a>:in `<top (required)>'
 
  <n>)
-Addrinfo#initialize using an Array with extra arguments with the AF_INET address family and an explicit socket protocol and no socket type is given raises SocketError when using IPPROTO_ICMPV6 FAILED
-Expected SocketError
-but no exception was raised (#<Addrinfo: 127.0.0.1:80 IPPROTO_ICMPV6 (hostname)> was returned)
-/export/home/rubyci/chkbuild-tmp/tmp/build/<buildtime>/ruby/spec/ruby/library/socket/addrinfo/initialize_spec.rb:<line_a>:in `block (7 levels) in <top (required)>'
-/export/home/rubyci/chkbuild-tmp/tmp/build/<buildtime>/ruby/spec/ruby/library/socket/addrinfo/initialize_spec.rb:<line_a>:in `<top (required)>'
 
  <n>)
-Addrinfo#initialize using an Array with extra arguments with the AF_INET address family and an explicit socket protocol and no socket type is given raises SocketError when using IPPROTO_IPV6 FAILED
-Expected SocketError
-but no exception was raised (#<Addrinfo: 127.0.0.1:80 IPPROTO_IPV6 (hostname)> was returned)
-/export/home/rubyci/chkbuild-tmp/tmp/build/<buildtime>/ruby/spec/ruby/library/socket/addrinfo/initialize_spec.rb:<line_a>:in `block (7 levels) in <top (required)>'
-/export/home/rubyci/chkbuild-tmp/tmp/build/<buildtime>/ruby/spec/ruby/library/socket/addrinfo/initialize_spec.rb:<line_a>:in `<top (required)>'
 
  <n>)
-Addrinfo#initialize using an Array with extra arguments with the AF_INET address family and an explicit socket protocol and no socket type is given raises SocketError when using IPPROTO_NONE FAILED
-Expected SocketError
-but no exception was raised (#<Addrinfo: 127.0.0.1:80 IPPROTO_NONE (hostname)> was returned)
-/export/home/rubyci/chkbuild-tmp/tmp/build/<buildtime>/ruby/spec/ruby/library/socket/addrinfo/initialize_spec.rb:<line_a>:in `block (7 levels) in <top (required)>'
-/export/home/rubyci/chkbuild-tmp/tmp/build/<buildtime>/ruby/spec/ruby/library/socket/addrinfo/initialize_spec.rb:<line_a>:in `<top (required)>'
 
  <n>)
-Addrinfo#initialize using an Array with extra arguments with the AF_INET address family and an explicit socket protocol and no socket type is given raises SocketError when using IPPROTO_ROUTING FAILED
-Expected SocketError
-but no exception was raised (#<Addrinfo: 127.0.0.1:80 IPPROTO_ROUTING (hostname)> was returned)
-/export/home/rubyci/chkbuild-tmp/tmp/build/<buildtime>/ruby/spec/ruby/library/socket/addrinfo/initialize_spec.rb:<line_a>:in `block (7 levels) in <top (required)>'
-/export/home/rubyci/chkbuild-tmp/tmp/build/<buildtime>/ruby/spec/ruby/library/socket/addrinfo/initialize_spec.rb:<line_a>:in `<top (required)>'
 
  <n>)
-Addrinfo#initialize using an Array with extra arguments with the AF_INET address family and an explicit socket protocol and no socket type is given raises SocketError when using IPPROTO_RAW FAILED
-Expected SocketError
-but no exception was raised (#<Addrinfo: 127.0.0.1:80 IPPROTO_RAW (hostname)> was returned)
-/export/home/rubyci/chkbuild-tmp/tmp/build/<buildtime>/ruby/spec/ruby/library/socket/addrinfo/initialize_spec.rb:<line_a>:in `block (7 levels) in <top (required)>'
-/export/home/rubyci/chkbuild-tmp/tmp/build/<buildtime>/ruby/spec/ruby/library/socket/addrinfo/initialize_spec.rb:<line_a>:in `<top (required)>'
 
  <n>)
-Addrinfo#initialize using an Array with extra arguments with the AF_INET address family and an explicit socket protocol and no socket type is given raises SocketError when using IPPROTO_MAX FAILED
-Expected SocketError
-but no exception was raised (#<Addrinfo: 127.0.0.1:80 IPPROTO_MAX (hostname)> was returned)
-/export/home/rubyci/chkbuild-tmp/tmp/build/<buildtime>/ruby/spec/ruby/library/socket/addrinfo/initialize_spec.rb:<line_a>:in `block (7 levels) in <top (required)>'
-/export/home/rubyci/chkbuild-tmp/tmp/build/<buildtime>/ruby/spec/ruby/library/socket/addrinfo/initialize_spec.rb:<line_a>:in `<top (required)>'
 
  <n>)
-Addrinfo#initialize using an Array with extra arguments with the AF_INET address family and an explicit socket protocol and the socket type is set to SOCK_DGRAM raises SocketError when using IPPROTO_ICMP FAILED
-Expected SocketError
-but no exception was raised (#<Addrinfo: 127.0.0.1:80 SOCK_DGRAM IPPROTO_ICMP (hostname)> was returned)
-/export/home/rubyci/chkbuild-tmp/tmp/build/<buildtime>/ruby/spec/ruby/library/socket/addrinfo/initialize_spec.rb:<line_b>:in `block (7 levels) in <top (required)>'
-/export/home/rubyci/chkbuild-tmp/tmp/build/<buildtime>/ruby/spec/ruby/library/socket/addrinfo/initialize_spec.rb:<line_a>:in `<top (required)>'
 
  <n>)
-Addrinfo#initialize using an Array with extra arguments with the AF_INET address family and an explicit socket protocol and the socket type is set to SOCK_DGRAM raises SocketError when using IPPROTO_IGMP FAILED
-Expected SocketError
-but no exception was raised (#<Addrinfo: 127.0.0.1:80 SOCK_DGRAM IPPROTO_IGMP (hostname)> was returned)
-/export/home/rubyci/chkbuild-tmp/tmp/build/<buildtime>/ruby/spec/ruby/library/socket/addrinfo/initialize_spec.rb:<line_b>:in `block (7 levels) in <top (required)>'
-/export/home/rubyci/chkbuild-tmp/tmp/build/<buildtime>/ruby/spec/ruby/library/socket/addrinfo/initialize_spec.rb:<line_a>:in `<top (required)>'
 
  <n>)
-Addrinfo#initialize using an Array with extra arguments with the AF_INET address family and an explicit socket protocol and the socket type is set to SOCK_DGRAM raises SocketError when using IPPROTO_GGP FAILED
-Expected SocketError
-but no exception was raised (#<Addrinfo: 127.0.0.1:80 SOCK_DGRAM IPPROTO_GGP (hostname)> was returned)
-/export/home/rubyci/chkbuild-tmp/tmp/build/<buildtime>/ruby/spec/ruby/library/socket/addrinfo/initialize_spec.rb:<line_b>:in `block (7 levels) in <top (required)>'
-/export/home/rubyci/chkbuild-tmp/tmp/build/<buildtime>/ruby/spec/ruby/library/socket/addrinfo/initialize_spec.rb:<line_a>:in `<top (required)>'
 
  <n>)
-Addrinfo#initialize using an Array with extra arguments with the AF_INET address family and an explicit socket protocol and the socket type is set to SOCK_DGRAM raises SocketError when using IPPROTO_TCP FAILED
-Expected SocketError
-but no exception was raised (#<Addrinfo: 127.0.0.1:80 SOCK_DGRAM IPPROTO_TCP (hostname)> was returned)
-/export/home/rubyci/chkbuild-tmp/tmp/build/<buildtime>/ruby/spec/ruby/library/socket/addrinfo/initialize_spec.rb:<line_b>:in `block (7 levels) in <top (required)>'
-/export/home/rubyci/chkbuild-tmp/tmp/build/<buildtime>/ruby/spec/ruby/library/socket/addrinfo/initialize_spec.rb:<line_a>:in `<top (required)>'
 
  <n>)
-Addrinfo#initialize using an Array with extra arguments with the AF_INET address family and an explicit socket protocol and the socket type is set to SOCK_DGRAM raises SocketError when using IPPROTO_EGP FAILED
-Expected SocketError
-but no exception was raised (#<Addrinfo: 127.0.0.1:80 SOCK_DGRAM IPPROTO_EGP (hostname)> was returned)
-/export/home/rubyci/chkbuild-tmp/tmp/build/<buildtime>/ruby/spec/ruby/library/socket/addrinfo/initialize_spec.rb:<line_b>:in `block (7 levels) in <top (required)>'
-/export/home/rubyci/chkbuild-tmp/tmp/build/<buildtime>/ruby/spec/ruby/library/socket/addrinfo/initialize_spec.rb:<line_a>:in `<top (required)>'
 
  <n>)
-Addrinfo#initialize using an Array with extra arguments with the AF_INET address family and an explicit socket protocol and the socket type is set to SOCK_DGRAM raises SocketError when using IPPROTO_PUP FAILED
-Expected SocketError
-but no exception was raised (#<Addrinfo: 127.0.0.1:80 SOCK_DGRAM IPPROTO_PUP (hostname)> was returned)
-/export/home/rubyci/chkbuild-tmp/tmp/build/<buildtime>/ruby/spec/ruby/library/socket/addrinfo/initialize_spec.rb:<line_b>:in `block (7 levels) in <top (required)>'
-/export/home/rubyci/chkbuild-tmp/tmp/build/<buildtime>/ruby/spec/ruby/library/socket/addrinfo/initialize_spec.rb:<line_a>:in `<top (required)>'
 
  <n>)
-Addrinfo#initialize using an Array with extra arguments with the AF_INET address family and an explicit socket protocol and the socket type is set to SOCK_DGRAM raises SocketError when using IPPROTO_IDP FAILED
-Expected SocketError
-but no exception was raised (#<Addrinfo: 127.0.0.1:80 SOCK_DGRAM IPPROTO_IDP (hostname)> was returned)
-/export/home/rubyci/chkbuild-tmp/tmp/build/<buildtime>/ruby/spec/ruby/library/socket/addrinfo/initialize_spec.rb:<line_b>:in `block (7 levels) in <top (required)>'
-/export/home/rubyci/chkbuild-tmp/tmp/build/<buildtime>/ruby/spec/ruby/library/socket/addrinfo/initialize_spec.rb:<line_a>:in `<top (required)>'
 
  <n>)
-Addrinfo#initialize using an Array with extra arguments with the AF_INET address family and an explicit socket protocol and the socket type is set to SOCK_DGRAM raises SocketError when using IPPROTO_HELLO FAILED
-Expected SocketError
-but no exception was raised (#<Addrinfo: 127.0.0.1:80 SOCK_DGRAM IPPROTO_HELLO (hostname)> was returned)
-/export/home/rubyci/chkbuild-tmp/tmp/build/<buildtime>/ruby/spec/ruby/library/socket/addrinfo/initialize_spec.rb:<line_b>:in `block (7 levels) in <top (required)>'
-/export/home/rubyci/chkbuild-tmp/tmp/build/<buildtime>/ruby/spec/ruby/library/socket/addrinfo/initialize_spec.rb:<line_a>:in `<top (required)>'
 
  <n>)
-Addrinfo#initialize using an Array with extra arguments with the AF_INET address family and an explicit socket protocol and the socket type is set to SOCK_DGRAM raises SocketError when using IPPROTO_ND FAILED
-Expected SocketError
-but no exception was raised (#<Addrinfo: 127.0.0.1:80 SOCK_DGRAM IPPROTO_ND (hostname)> was returned)
-/export/home/rubyci/chkbuild-tmp/tmp/build/<buildtime>/ruby/spec/ruby/library/socket/addrinfo/initialize_spec.rb:<line_b>:in `block (7 levels) in <top (required)>'
-/export/home/rubyci/chkbuild-tmp/tmp/build/<buildtime>/ruby/spec/ruby/library/socket/addrinfo/initialize_spec.rb:<line_a>:in `<top (required)>'
 
  <n>)
-Addrinfo#initialize using an Array with extra arguments with the AF_INET address family and an explicit socket protocol and the socket type is set to SOCK_DGRAM raises SocketError when using IPPROTO_EON FAILED
-Expected SocketError
-but no exception was raised (#<Addrinfo: 127.0.0.1:80 SOCK_DGRAM IPPROTO_EON (hostname)> was returned)
-/export/home/rubyci/chkbuild-tmp/tmp/build/<buildtime>/ruby/spec/ruby/library/socket/addrinfo/initialize_spec.rb:<line_b>:in `block (7 levels) in <top (required)>'
-/export/home/rubyci/chkbuild-tmp/tmp/build/<buildtime>/ruby/spec/ruby/library/socket/addrinfo/initialize_spec.rb:<line_a>:in `<top (required)>'
 
  <n>)
-Addrinfo#initialize using an Array with extra arguments with the AF_INET address family and an explicit socket protocol and the socket type is set to SOCK_DGRAM raises SocketError when using IPPROTO_AH FAILED
-Expected SocketError
-but no exception was raised (#<Addrinfo: 127.0.0.1:80 SOCK_DGRAM IPPROTO_AH (hostname)> was returned)
-/export/home/rubyci/chkbuild-tmp/tmp/build/<buildtime>/ruby/spec/ruby/library/socket/addrinfo/initialize_spec.rb:<line_b>:in `block (7 levels) in <top (required)>'
-/export/home/rubyci/chkbuild-tmp/tmp/build/<buildtime>/ruby/spec/ruby/library/socket/addrinfo/initialize_spec.rb:<line_a>:in `<top (required)>'
 
  <n>)
-Addrinfo#initialize using an Array with extra arguments with the AF_INET address family and an explicit socket protocol and the socket type is set to SOCK_DGRAM raises SocketError when using IPPROTO_DSTOPTS FAILED
-Expected SocketError
-but no exception was raised (#<Addrinfo: 127.0.0.1:80 SOCK_DGRAM IPPROTO_DSTOPTS (hostname)> was returned)
-/export/home/rubyci/chkbuild-tmp/tmp/build/<buildtime>/ruby/spec/ruby/library/socket/addrinfo/initialize_spec.rb:<line_b>:in `block (7 levels) in <top (required)>'
-/export/home/rubyci/chkbuild-tmp/tmp/build/<buildtime>/ruby/spec/ruby/library/socket/addrinfo/initialize_spec.rb:<line_a>:in `<top (required)>'
 
  <n>)
-Addrinfo#initialize using an Array with extra arguments with the AF_INET address family and an explicit socket protocol and the socket type is set to SOCK_DGRAM raises SocketError when using IPPROTO_ESP FAILED
-Expected SocketError
-but no exception was raised (#<Addrinfo: 127.0.0.1:80 SOCK_DGRAM IPPROTO_ESP (hostname)> was returned)
-/export/home/rubyci/chkbuild-tmp/tmp/build/<buildtime>/ruby/spec/ruby/library/socket/addrinfo/initialize_spec.rb:<line_b>:in `block (7 levels) in <top (required)>'
-/export/home/rubyci/chkbuild-tmp/tmp/build/<buildtime>/ruby/spec/ruby/library/socket/addrinfo/initialize_spec.rb:<line_a>:in `<top (required)>'
 
  <n>)
-Addrinfo#initialize using an Array with extra arguments with the AF_INET address family and an explicit socket protocol and the socket type is set to SOCK_DGRAM raises SocketError when using IPPROTO_FRAGMENT FAILED
-Expected SocketError
-but no exception was raised (#<Addrinfo: 127.0.0.1:80 SOCK_DGRAM IPPROTO_FRAGMENT (hostname)> was returned)
-/export/home/rubyci/chkbuild-tmp/tmp/build/<buildtime>/ruby/spec/ruby/library/socket/addrinfo/initialize_spec.rb:<line_b>:in `block (7 levels) in <top (required)>'
-/export/home/rubyci/chkbuild-tmp/tmp/build/<buildtime>/ruby/spec/ruby/library/socket/addrinfo/initialize_spec.rb:<line_a>:in `<top (required)>'
 
  <n>)
-Addrinfo#initialize using an Array with extra arguments with the AF_INET address family and an explicit socket protocol and the socket type is set to SOCK_DGRAM raises SocketError when using IPPROTO_ICMPV6 FAILED
-Expected SocketError
-but no exception was raised (#<Addrinfo: 127.0.0.1:80 SOCK_DGRAM IPPROTO_ICMPV6 (hostname)> was returned)
-/export/home/rubyci/chkbuild-tmp/tmp/build/<buildtime>/ruby/spec/ruby/library/socket/addrinfo/initialize_spec.rb:<line_b>:in `block (7 levels) in <top (required)>'
-/export/home/rubyci/chkbuild-tmp/tmp/build/<buildtime>/ruby/spec/ruby/library/socket/addrinfo/initialize_spec.rb:<line_a>:in `<top (required)>'
 
  <n>)
-Addrinfo#initialize using an Array with extra arguments with the AF_INET address family and an explicit socket protocol and the socket type is set to SOCK_DGRAM raises SocketError when using IPPROTO_IPV6 FAILED
-Expected SocketError
-but no exception was raised (#<Addrinfo: 127.0.0.1:80 SOCK_DGRAM IPPROTO_IPV6 (hostname)> was returned)
-/export/home/rubyci/chkbuild-tmp/tmp/build/<buildtime>/ruby/spec/ruby/library/socket/addrinfo/initialize_spec.rb:<line_b>:in `block (7 levels) in <top (required)>'
-/export/home/rubyci/chkbuild-tmp/tmp/build/<buildtime>/ruby/spec/ruby/library/socket/addrinfo/initialize_spec.rb:<line_a>:in `<top (required)>'
 
  <n>)
-Addrinfo#initialize using an Array with extra arguments with the AF_INET address family and an explicit socket protocol and the socket type is set to SOCK_DGRAM raises SocketError when using IPPROTO_NONE FAILED
-Expected SocketError
-but no exception was raised (#<Addrinfo: 127.0.0.1:80 SOCK_DGRAM IPPROTO_NONE (hostname)> was returned)
-/export/home/rubyci/chkbuild-tmp/tmp/build/<buildtime>/ruby/spec/ruby/library/socket/addrinfo/initialize_spec.rb:<line_b>:in `block (7 levels) in <top (required)>'
-/export/home/rubyci/chkbuild-tmp/tmp/build/<buildtime>/ruby/spec/ruby/library/socket/addrinfo/initialize_spec.rb:<line_a>:in `<top (required)>'
 
  <n>)
-Addrinfo#initialize using an Array with extra arguments with the AF_INET address family and an explicit socket protocol and the socket type is set to SOCK_DGRAM raises SocketError when using IPPROTO_ROUTING FAILED
-Expected SocketError
-but no exception was raised (#<Addrinfo: 127.0.0.1:80 SOCK_DGRAM IPPROTO_ROUTING (hostname)> was returned)
-/export/home/rubyci/chkbuild-tmp/tmp/build/<buildtime>/ruby/spec/ruby/library/socket/addrinfo/initialize_spec.rb:<line_b>:in `block (7 levels) in <top (required)>'
-/export/home/rubyci/chkbuild-tmp/tmp/build/<buildtime>/ruby/spec/ruby/library/socket/addrinfo/initialize_spec.rb:<line_a>:in `<top (required)>'
 
  <n>)
-Addrinfo#initialize using an Array with extra arguments with the AF_INET address family and an explicit socket protocol and the socket type is set to SOCK_DGRAM raises SocketError when using IPPROTO_RAW FAILED
-Expected SocketError
-but no exception was raised (#<Addrinfo: 127.0.0.1:80 SOCK_DGRAM IPPROTO_RAW (hostname)> was returned)
-/export/home/rubyci/chkbuild-tmp/tmp/build/<buildtime>/ruby/spec/ruby/library/socket/addrinfo/initialize_spec.rb:<line_b>:in `block (7 levels) in <top (required)>'
-/export/home/rubyci/chkbuild-tmp/tmp/build/<buildtime>/ruby/spec/ruby/library/socket/addrinfo/initialize_spec.rb:<line_a>:in `<top (required)>'
 
  <n>)
-Addrinfo#initialize using an Array with extra arguments with the AF_INET address family and an explicit socket protocol and the socket type is set to SOCK_DGRAM raises SocketError when using IPPROTO_MAX FAILED
-Expected SocketError
-but no exception was raised (#<Addrinfo: 127.0.0.1:80 SOCK_DGRAM IPPROTO_MAX (hostname)> was returned)
-/export/home/rubyci/chkbuild-tmp/tmp/build/<buildtime>/ruby/spec/ruby/library/socket/addrinfo/initialize_spec.rb:<line_b>:in `block (7 levels) in <top (required)>'
-/export/home/rubyci/chkbuild-tmp/tmp/build/<buildtime>/ruby/spec/ruby/library/socket/addrinfo/initialize_spec.rb:<line_a>:in `<top (required)>'
 
  <n>)
-Addrinfo#initialize using an Array with extra arguments with the AF_INET address family and an explicit socket protocol and the socket type is set to SOCK_SEQPACKET raises SocketError when using IPPROTO_ICMP FAILED
-Expected SocketError
-but no exception was raised (#<Addrinfo: 127.0.0.1:80 SOCK_SEQPACKET IPPROTO_ICMP (hostname)> was returned)
-/export/home/rubyci/chkbuild-tmp/tmp/build/<buildtime>/ruby/spec/ruby/library/socket/addrinfo/initialize_spec.rb:<line_c>:in `block (7 levels) in <top (required)>'
-/export/home/rubyci/chkbuild-tmp/tmp/build/<buildtime>/ruby/spec/ruby/library/socket/addrinfo/initialize_spec.rb:<line_a>:in `<top (required)>'
 
  <n>)
-Addrinfo#initialize using an Array with extra arguments with the AF_INET address family and an explicit socket protocol and the socket type is set to SOCK_SEQPACKET raises SocketError when using IPPROTO_IGMP FAILED
-Expected SocketError
-but no exception was raised (#<Addrinfo: 127.0.0.1:80 SOCK_SEQPACKET IPPROTO_IGMP (hostname)> was returned)
-/export/home/rubyci/chkbuild-tmp/tmp/build/<buildtime>/ruby/spec/ruby/library/socket/addrinfo/initialize_spec.rb:<line_c>:in `block (7 levels) in <top (required)>'
-/export/home/rubyci/chkbuild-tmp/tmp/build/<buildtime>/ruby/spec/ruby/library/socket/addrinfo/initialize_spec.rb:<line_a>:in `<top (required)>'
 
  <n>)
-Addrinfo#initialize using an Array with extra arguments with the AF_INET address family and an explicit socket protocol and the socket type is set to SOCK_SEQPACKET raises SocketError when using IPPROTO_GGP FAILED
-Expected SocketError
-but no exception was raised (#<Addrinfo: 127.0.0.1:80 SOCK_SEQPACKET IPPROTO_GGP (hostname)> was returned)
-/export/home/rubyci/chkbuild-tmp/tmp/build/<buildtime>/ruby/spec/ruby/library/socket/addrinfo/initialize_spec.rb:<line_c>:in `block (7 levels) in <top (required)>'
-/export/home/rubyci/chkbuild-tmp/tmp/build/<buildtime>/ruby/spec/ruby/library/socket/addrinfo/initialize_spec.rb:<line_a>:in `<top (required)>'
 
  <n>)
-Addrinfo#initialize using an Array with extra arguments with the AF_INET address family and an explicit socket protocol and the socket type is set to SOCK_SEQPACKET raises SocketError when using IPPROTO_TCP FAILED
-Expected SocketError
-but no exception was raised (#<Addrinfo: 127.0.0.1:80 SOCK_SEQPACKET IPPROTO_TCP (hostname)> was returned)
-/export/home/rubyci/chkbuild-tmp/tmp/build/<buildtime>/ruby/spec/ruby/library/socket/addrinfo/initialize_spec.rb:<line_c>:in `block (7 levels) in <top (required)>'
-/export/home/rubyci/chkbuild-tmp/tmp/build/<buildtime>/ruby/spec/ruby/library/socket/addrinfo/initialize_spec.rb:<line_a>:in `<top (required)>'
 
  <n>)
-Addrinfo#initialize using an Array with extra arguments with the AF_INET address family and an explicit socket protocol and the socket type is set to SOCK_SEQPACKET raises SocketError when using IPPROTO_EGP FAILED
-Expected SocketError
-but no exception was raised (#<Addrinfo: 127.0.0.1:80 SOCK_SEQPACKET IPPROTO_EGP (hostname)> was returned)
-/export/home/rubyci/chkbuild-tmp/tmp/build/<buildtime>/ruby/spec/ruby/library/socket/addrinfo/initialize_spec.rb:<line_c>:in `block (7 levels) in <top (required)>'
-/export/home/rubyci/chkbuild-tmp/tmp/build/<buildtime>/ruby/spec/ruby/library/socket/addrinfo/initialize_spec.rb:<line_a>:in `<top (required)>'
 
  <n>)
-Addrinfo#initialize using an Array with extra arguments with the AF_INET address family and an explicit socket protocol and the socket type is set to SOCK_SEQPACKET raises SocketError when using IPPROTO_PUP FAILED
-Expected SocketError
-but no exception was raised (#<Addrinfo: 127.0.0.1:80 SOCK_SEQPACKET IPPROTO_PUP (hostname)> was returned)
-/export/home/rubyci/chkbuild-tmp/tmp/build/<buildtime>/ruby/spec/ruby/library/socket/addrinfo/initialize_spec.rb:<line_c>:in `block (7 levels) in <top (required)>'
-/export/home/rubyci/chkbuild-tmp/tmp/build/<buildtime>/ruby/spec/ruby/library/socket/addrinfo/initialize_spec.rb:<line_a>:in `<top (required)>'
 
  <n>)
-Addrinfo#initialize using an Array with extra arguments with the AF_INET address family and an explicit socket protocol and the socket type is set to SOCK_SEQPACKET raises SocketError when using IPPROTO_UDP FAILED
-Expected SocketError
-but no exception was raised (#<Addrinfo: 127.0.0.1:80 SOCK_SEQPACKET IPPROTO_UDP (hostname)> was returned)
-/export/home/rubyci/chkbuild-tmp/tmp/build/<buildtime>/ruby/spec/ruby/library/socket/addrinfo/initialize_spec.rb:<line_c>:in `block (7 levels) in <top (required)>'
-/export/home/rubyci/chkbuild-tmp/tmp/build/<buildtime>/ruby/spec/ruby/library/socket/addrinfo/initialize_spec.rb:<line_a>:in `<top (required)>'
 
  <n>)
-Addrinfo#initialize using an Array with extra arguments with the AF_INET address family and an explicit socket protocol and the socket type is set to SOCK_SEQPACKET raises SocketError when using IPPROTO_IDP FAILED
-Expected SocketError
-but no exception was raised (#<Addrinfo: 127.0.0.1:80 SOCK_SEQPACKET IPPROTO_IDP (hostname)> was returned)
-/export/home/rubyci/chkbuild-tmp/tmp/build/<buildtime>/ruby/spec/ruby/library/socket/addrinfo/initialize_spec.rb:<line_c>:in `block (7 levels) in <top (required)>'
-/export/home/rubyci/chkbuild-tmp/tmp/build/<buildtime>/ruby/spec/ruby/library/socket/addrinfo/initialize_spec.rb:<line_a>:in `<top (required)>'
 
  <n>)
-Addrinfo#initialize using an Array with extra arguments with the AF_INET address family and an explicit socket protocol and the socket type is set to SOCK_SEQPACKET raises SocketError when using IPPROTO_HELLO FAILED
-Expected SocketError
-but no exception was raised (#<Addrinfo: 127.0.0.1:80 SOCK_SEQPACKET IPPROTO_HELLO (hostname)> was returned)
-/export/home/rubyci/chkbuild-tmp/tmp/build/<buildtime>/ruby/spec/ruby/library/socket/addrinfo/initialize_spec.rb:<line_c>:in `block (7 levels) in <top (required)>'
-/export/home/rubyci/chkbuild-tmp/tmp/build/<buildtime>/ruby/spec/ruby/library/socket/addrinfo/initialize_spec.rb:<line_a>:in `<top (required)>'
 
  <n>)
-Addrinfo#initialize using an Array with extra arguments with the AF_INET address family and an explicit socket protocol and the socket type is set to SOCK_SEQPACKET raises SocketError when using IPPROTO_ND FAILED
-Expected SocketError
-but no exception was raised (#<Addrinfo: 127.0.0.1:80 SOCK_SEQPACKET IPPROTO_ND (hostname)> was returned)
-/export/home/rubyci/chkbuild-tmp/tmp/build/<buildtime>/ruby/spec/ruby/library/socket/addrinfo/initialize_spec.rb:<line_c>:in `block (7 levels) in <top (required)>'
-/export/home/rubyci/chkbuild-tmp/tmp/build/<buildtime>/ruby/spec/ruby/library/socket/addrinfo/initialize_spec.rb:<line_a>:in `<top (required)>'
 
  <n>)
-Addrinfo#initialize using an Array with extra arguments with the AF_INET address family and an explicit socket protocol and the socket type is set to SOCK_SEQPACKET raises SocketError when using IPPROTO_EON FAILED
-Expected SocketError
-but no exception was raised (#<Addrinfo: 127.0.0.1:80 SOCK_SEQPACKET IPPROTO_EON (hostname)> was returned)
-/export/home/rubyci/chkbuild-tmp/tmp/build/<buildtime>/ruby/spec/ruby/library/socket/addrinfo/initialize_spec.rb:<line_c>:in `block (7 levels) in <top (required)>'
-/export/home/rubyci/chkbuild-tmp/tmp/build/<buildtime>/ruby/spec/ruby/library/socket/addrinfo/initialize_spec.rb:<line_a>:in `<top (required)>'
 
  <n>)
-Addrinfo#initialize using an Array with extra arguments with the AF_INET address family and an explicit socket protocol and the socket type is set to SOCK_SEQPACKET raises SocketError when using IPPROTO_AH FAILED
-Expected SocketError
-but no exception was raised (#<Addrinfo: 127.0.0.1:80 SOCK_SEQPACKET IPPROTO_AH (hostname)> was returned)
-/export/home/rubyci/chkbuild-tmp/tmp/build/<buildtime>/ruby/spec/ruby/library/socket/addrinfo/initialize_spec.rb:<line_c>:in `block (7 levels) in <top (required)>'
-/export/home/rubyci/chkbuild-tmp/tmp/build/<buildtime>/ruby/spec/ruby/library/socket/addrinfo/initialize_spec.rb:<line_a>:in `<top (required)>'
 
  <n>)
-Addrinfo#initialize using an Array with extra arguments with the AF_INET address family and an explicit socket protocol and the socket type is set to SOCK_SEQPACKET raises SocketError when using IPPROTO_DSTOPTS FAILED
-Expected SocketError
-but no exception was raised (#<Addrinfo: 127.0.0.1:80 SOCK_SEQPACKET IPPROTO_DSTOPTS (hostname)> was returned)
-/export/home/rubyci/chkbuild-tmp/tmp/build/<buildtime>/ruby/spec/ruby/library/socket/addrinfo/initialize_spec.rb:<line_c>:in `block (7 levels) in <top (required)>'
-/export/home/rubyci/chkbuild-tmp/tmp/build/<buildtime>/ruby/spec/ruby/library/socket/addrinfo/initialize_spec.rb:<line_a>:in `<top (required)>'
 
  <n>)
-Addrinfo#initialize using an Array with extra arguments with the AF_INET address family and an explicit socket protocol and the socket type is set to SOCK_SEQPACKET raises SocketError when using IPPROTO_ESP FAILED
-Expected SocketError
-but no exception was raised (#<Addrinfo: 127.0.0.1:80 SOCK_SEQPACKET IPPROTO_ESP (hostname)> was returned)
-/export/home/rubyci/chkbuild-tmp/tmp/build/<buildtime>/ruby/spec/ruby/library/socket/addrinfo/initialize_spec.rb:<line_c>:in `block (7 levels) in <top (required)>'
-/export/home/rubyci/chkbuild-tmp/tmp/build/<buildtime>/ruby/spec/ruby/library/socket/addrinfo/initialize_spec.rb:<line_a>:in `<top (required)>'
 
  <n>)
-Addrinfo#initialize using an Array with extra arguments with the AF_INET address family and an explicit socket protocol and the socket type is set to SOCK_SEQPACKET raises SocketError when using IPPROTO_FRAGMENT FAILED
-Expected SocketError
-but no exception was raised (#<Addrinfo: 127.0.0.1:80 SOCK_SEQPACKET IPPROTO_FRAGMENT (hostname)> was returned)
-/export/home/rubyci/chkbuild-tmp/tmp/build/<buildtime>/ruby/spec/ruby/library/socket/addrinfo/initialize_spec.rb:<line_c>:in `block (7 levels) in <top (required)>'
-/export/home/rubyci/chkbuild-tmp/tmp/build/<buildtime>/ruby/spec/ruby/library/socket/addrinfo/initialize_spec.rb:<line_a>:in `<top (required)>'
 
  <n>)
-Addrinfo#initialize using an Array with extra arguments with the AF_INET address family and an explicit socket protocol and the socket type is set to SOCK_SEQPACKET raises SocketError when using IPPROTO_ICMPV6 FAILED
-Expected SocketError
-but no exception was raised (#<Addrinfo: 127.0.0.1:80 SOCK_SEQPACKET IPPROTO_ICMPV6 (hostname)> was returned)
-/export/home/rubyci/chkbuild-tmp/tmp/build/<buildtime>/ruby/spec/ruby/library/socket/addrinfo/initialize_spec.rb:<line_c>:in `block (7 levels) in <top (required)>'
-/export/home/rubyci/chkbuild-tmp/tmp/build/<buildtime>/ruby/spec/ruby/library/socket/addrinfo/initialize_spec.rb:<line_a>:in `<top (required)>'
 
  <n>)
-Addrinfo#initialize using an Array with extra arguments with the AF_INET address family and an explicit socket protocol and the socket type is set to SOCK_SEQPACKET raises SocketError when using IPPROTO_IPV6 FAILED
-Expected SocketError
-but no exception was raised (#<Addrinfo: 127.0.0.1:80 SOCK_SEQPACKET IPPROTO_IPV6 (hostname)> was returned)
-/export/home/rubyci/chkbuild-tmp/tmp/build/<buildtime>/ruby/spec/ruby/library/socket/addrinfo/initialize_spec.rb:<line_c>:in `block (7 levels) in <top (required)>'
-/export/home/rubyci/chkbuild-tmp/tmp/build/<buildtime>/ruby/spec/ruby/library/socket/addrinfo/initialize_spec.rb:<line_a>:in `<top (required)>'
 
  <n>)
-Addrinfo#initialize using an Array with extra arguments with the AF_INET address family and an explicit socket protocol and the socket type is set to SOCK_SEQPACKET raises SocketError when using IPPROTO_NONE FAILED
-Expected SocketError
-but no exception was raised (#<Addrinfo: 127.0.0.1:80 SOCK_SEQPACKET IPPROTO_NONE (hostname)> was returned)
-/export/home/rubyci/chkbuild-tmp/tmp/build/<buildtime>/ruby/spec/ruby/library/socket/addrinfo/initialize_spec.rb:<line_c>:in `block (7 levels) in <top (required)>'
-/export/home/rubyci/chkbuild-tmp/tmp/build/<buildtime>/ruby/spec/ruby/library/socket/addrinfo/initialize_spec.rb:<line_a>:in `<top (required)>'
 
  <n>)
-Addrinfo#initialize using an Array with extra arguments with the AF_INET address family and an explicit socket protocol and the socket type is set to SOCK_SEQPACKET raises SocketError when using IPPROTO_ROUTING FAILED
-Expected SocketError
-but no exception was raised (#<Addrinfo: 127.0.0.1:80 SOCK_SEQPACKET IPPROTO_ROUTING (hostname)> was returned)
-/export/home/rubyci/chkbuild-tmp/tmp/build/<buildtime>/ruby/spec/ruby/library/socket/addrinfo/initialize_spec.rb:<line_c>:in `block (7 levels) in <top (required)>'
-/export/home/rubyci/chkbuild-tmp/tmp/build/<buildtime>/ruby/spec/ruby/library/socket/addrinfo/initialize_spec.rb:<line_a>:in `<top (required)>'
 
  <n>)
-Addrinfo#initialize using an Array with extra arguments with the AF_INET address family and an explicit socket protocol and the socket type is set to SOCK_SEQPACKET raises SocketError when using IPPROTO_RAW FAILED
-Expected SocketError
-but no exception was raised (#<Addrinfo: 127.0.0.1:80 SOCK_SEQPACKET IPPROTO_RAW (hostname)> was returned)
-/export/home/rubyci/chkbuild-tmp/tmp/build/<buildtime>/ruby/spec/ruby/library/socket/addrinfo/initialize_spec.rb:<line_c>:in `block (7 levels) in <top (required)>'
-/export/home/rubyci/chkbuild-tmp/tmp/build/<buildtime>/ruby/spec/ruby/library/socket/addrinfo/initialize_spec.rb:<line_a>:in `<top (required)>'
 
  <n>)
-Addrinfo#initialize using an Array with extra arguments with the AF_INET address family and an explicit socket protocol and the socket type is set to SOCK_SEQPACKET raises SocketError when using IPPROTO_MAX FAILED
-Expected SocketError
-but no exception was raised (#<Addrinfo: 127.0.0.1:80 SOCK_SEQPACKET IPPROTO_MAX (hostname)> was returned)
-/export/home/rubyci/chkbuild-tmp/tmp/build/<buildtime>/ruby/spec/ruby/library/socket/addrinfo/initialize_spec.rb:<line_c>:in `block (7 levels) in <top (required)>'
-/export/home/rubyci/chkbuild-tmp/tmp/build/<buildtime>/ruby/spec/ruby/library/socket/addrinfo/initialize_spec.rb:<line_a>:in `<top (required)>'
 
  <n>)
-Addrinfo#initialize using an Array with extra arguments with the AF_INET address family and an explicit socket protocol and the socket type is set to SOCK_STREAM raises SocketError when using IPPROTO_ICMP FAILED
-Expected SocketError
-but no exception was raised (#<Addrinfo: 127.0.0.1:80 SOCK_STREAM IPPROTO_ICMP (hostname)> was returned)
-/export/home/rubyci/chkbuild-tmp/tmp/build/<buildtime>/ruby/spec/ruby/library/socket/addrinfo/initialize_spec.rb:<line_d>:in `block (7 levels) in <top (required)>'
-/export/home/rubyci/chkbuild-tmp/tmp/build/<buildtime>/ruby/spec/ruby/library/socket/addrinfo/initialize_spec.rb:<line_a>:in `<top (required)>'
 
  <n>)
-Addrinfo#initialize using an Array with extra arguments with the AF_INET address family and an explicit socket protocol and the socket type is set to SOCK_STREAM raises SocketError when using IPPROTO_IGMP FAILED
-Expected SocketError
-but no exception was raised (#<Addrinfo: 127.0.0.1:80 SOCK_STREAM IPPROTO_IGMP (hostname)> was returned)
-/export/home/rubyci/chkbuild-tmp/tmp/build/<buildtime>/ruby/spec/ruby/library/socket/addrinfo/initialize_spec.rb:<line_d>:in `block (7 levels) in <top (required)>'
-/export/home/rubyci/chkbuild-tmp/tmp/build/<buildtime>/ruby/spec/ruby/library/socket/addrinfo/initialize_spec.rb:<line_a>:in `<top (required)>'
 
  <n>)
-Addrinfo#initialize using an Array with extra arguments with the AF_INET address family and an explicit socket protocol and the socket type is set to SOCK_STREAM raises SocketError when using IPPROTO_GGP FAILED
-Expected SocketError
-but no exception was raised (#<Addrinfo: 127.0.0.1:80 SOCK_STREAM IPPROTO_GGP (hostname)> was returned)
-/export/home/rubyci/chkbuild-tmp/tmp/build/<buildtime>/ruby/spec/ruby/library/socket/addrinfo/initialize_spec.rb:<line_d>:in `block (7 levels) in <top (required)>'
-/export/home/rubyci/chkbuild-tmp/tmp/build/<buildtime>/ruby/spec/ruby/library/socket/addrinfo/initialize_spec.rb:<line_a>:in `<top (required)>'
 
  <n>)
-Addrinfo#initialize using an Array with extra arguments with the AF_INET address family and an explicit socket protocol and the socket type is set to SOCK_STREAM raises SocketError when using IPPROTO_EGP FAILED
-Expected SocketError
-but no exception was raised (#<Addrinfo: 127.0.0.1:80 SOCK_STREAM IPPROTO_EGP (hostname)> was returned)
-/export/home/rubyci/chkbuild-tmp/tmp/build/<buildtime>/ruby/spec/ruby/library/socket/addrinfo/initialize_spec.rb:<line_d>:in `block (7 levels) in <top (required)>'
-/export/home/rubyci/chkbuild-tmp/tmp/build/<buildtime>/ruby/spec/ruby/library/socket/addrinfo/initialize_spec.rb:<line_a>:in `<top (required)>'
 
  <n>)
-Addrinfo#initialize using an Array with extra arguments with the AF_INET address family and an explicit socket protocol and the socket type is set to SOCK_STREAM raises SocketError when using IPPROTO_PUP FAILED
-Expected SocketError
-but no exception was raised (#<Addrinfo: 127.0.0.1:80 SOCK_STREAM IPPROTO_PUP (hostname)> was returned)
-/export/home/rubyci/chkbuild-tmp/tmp/build/<buildtime>/ruby/spec/ruby/library/socket/addrinfo/initialize_spec.rb:<line_d>:in `block (7 levels) in <top (required)>'
-/export/home/rubyci/chkbuild-tmp/tmp/build/<buildtime>/ruby/spec/ruby/library/socket/addrinfo/initialize_spec.rb:<line_a>:in `<top (required)>'
 
  <n>)
-Addrinfo#initialize using an Array with extra arguments with the AF_INET address family and an explicit socket protocol and the socket type is set to SOCK_STREAM raises SocketError when using IPPROTO_UDP FAILED
-Expected SocketError
-but no exception was raised (#<Addrinfo: 127.0.0.1:80 SOCK_STREAM IPPROTO_UDP (hostname)> was returned)
-/export/home/rubyci/chkbuild-tmp/tmp/build/<buildtime>/ruby/spec/ruby/library/socket/addrinfo/initialize_spec.rb:<line_d>:in `block (7 levels) in <top (required)>'
-/export/home/rubyci/chkbuild-tmp/tmp/build/<buildtime>/ruby/spec/ruby/library/socket/addrinfo/initialize_spec.rb:<line_a>:in `<top (required)>'
 
  <n>)
-Addrinfo#initialize using an Array with extra arguments with the AF_INET address family and an explicit socket protocol and the socket type is set to SOCK_STREAM raises SocketError when using IPPROTO_IDP FAILED
-Expected SocketError
-but no exception was raised (#<Addrinfo: 127.0.0.1:80 SOCK_STREAM IPPROTO_IDP (hostname)> was returned)
-/export/home/rubyci/chkbuild-tmp/tmp/build/<buildtime>/ruby/spec/ruby/library/socket/addrinfo/initialize_spec.rb:<line_d>:in `block (7 levels) in <top (required)>'
-/export/home/rubyci/chkbuild-tmp/tmp/build/<buildtime>/ruby/spec/ruby/library/socket/addrinfo/initialize_spec.rb:<line_a>:in `<top (required)>'
 
  <n>)
-Addrinfo#initialize using an Array with extra arguments with the AF_INET address family and an explicit socket protocol and the socket type is set to SOCK_STREAM raises SocketError when using IPPROTO_HELLO FAILED
-Expected SocketError
-but no exception was raised (#<Addrinfo: 127.0.0.1:80 SOCK_STREAM IPPROTO_HELLO (hostname)> was returned)
-/export/home/rubyci/chkbuild-tmp/tmp/build/<buildtime>/ruby/spec/ruby/library/socket/addrinfo/initialize_spec.rb:<line_d>:in `block (7 levels) in <top (required)>'
-/export/home/rubyci/chkbuild-tmp/tmp/build/<buildtime>/ruby/spec/ruby/library/socket/addrinfo/initialize_spec.rb:<line_a>:in `<top (required)>'
 
  <n>)
-Addrinfo#initialize using an Array with extra arguments with the AF_INET address family and an explicit socket protocol and the socket type is set to SOCK_STREAM raises SocketError when using IPPROTO_ND FAILED
-Expected SocketError
-but no exception was raised (#<Addrinfo: 127.0.0.1:80 SOCK_STREAM IPPROTO_ND (hostname)> was returned)
-/export/home/rubyci/chkbuild-tmp/tmp/build/<buildtime>/ruby/spec/ruby/library/socket/addrinfo/initialize_spec.rb:<line_d>:in `block (7 levels) in <top (required)>'
-/export/home/rubyci/chkbuild-tmp/tmp/build/<buildtime>/ruby/spec/ruby/library/socket/addrinfo/initialize_spec.rb:<line_a>:in `<top (required)>'
 
  <n>)
-Addrinfo#initialize using an Array with extra arguments with the AF_INET address family and an explicit socket protocol and the socket type is set to SOCK_STREAM raises SocketError when using IPPROTO_EON FAILED
-Expected SocketError
-but no exception was raised (#<Addrinfo: 127.0.0.1:80 SOCK_STREAM IPPROTO_EON (hostname)> was returned)
-/export/home/rubyci/chkbuild-tmp/tmp/build/<buildtime>/ruby/spec/ruby/library/socket/addrinfo/initialize_spec.rb:<line_d>:in `block (7 levels) in <top (required)>'
-/export/home/rubyci/chkbuild-tmp/tmp/build/<buildtime>/ruby/spec/ruby/library/socket/addrinfo/initialize_spec.rb:<line_a>:in `<top (required)>'
 
  <n>)
-Addrinfo#initialize using an Array with extra arguments with the AF_INET address family and an explicit socket protocol and the socket type is set to SOCK_STREAM raises SocketError when using IPPROTO_AH FAILED
-Expected SocketError
-but no exception was raised (#<Addrinfo: 127.0.0.1:80 SOCK_STREAM IPPROTO_AH (hostname)> was returned)
-/export/home/rubyci/chkbuild-tmp/tmp/build/<buildtime>/ruby/spec/ruby/library/socket/addrinfo/initialize_spec.rb:<line_d>:in `block (7 levels) in <top (required)>'
-/export/home/rubyci/chkbuild-tmp/tmp/build/<buildtime>/ruby/spec/ruby/library/socket/addrinfo/initialize_spec.rb:<line_a>:in `<top (required)>'
 
  <n>)
-Addrinfo#initialize using an Array with extra arguments with the AF_INET address family and an explicit socket protocol and the socket type is set to SOCK_STREAM raises SocketError when using IPPROTO_DSTOPTS FAILED
-Expected SocketError
-but no exception was raised (#<Addrinfo: 127.0.0.1:80 SOCK_STREAM IPPROTO_DSTOPTS (hostname)> was returned)
-/export/home/rubyci/chkbuild-tmp/tmp/build/<buildtime>/ruby/spec/ruby/library/socket/addrinfo/initialize_spec.rb:<line_d>:in `block (7 levels) in <top (required)>'
-/export/home/rubyci/chkbuild-tmp/tmp/build/<buildtime>/ruby/spec/ruby/library/socket/addrinfo/initialize_spec.rb:<line_a>:in `<top (required)>'
 
  <n>)
-Addrinfo#initialize using an Array with extra arguments with the AF_INET address family and an explicit socket protocol and the socket type is set to SOCK_STREAM raises SocketError when using IPPROTO_ESP FAILED
-Expected SocketError
-but no exception was raised (#<Addrinfo: 127.0.0.1:80 SOCK_STREAM IPPROTO_ESP (hostname)> was returned)
-/export/home/rubyci/chkbuild-tmp/tmp/build/<buildtime>/ruby/spec/ruby/library/socket/addrinfo/initialize_spec.rb:<line_d>:in `block (7 levels) in <top (required)>'
-/export/home/rubyci/chkbuild-tmp/tmp/build/<buildtime>/ruby/spec/ruby/library/socket/addrinfo/initialize_spec.rb:<line_a>:in `<top (required)>'
 
  <n>)
-Addrinfo#initialize using an Array with extra arguments with the AF_INET address family and an explicit socket protocol and the socket type is set to SOCK_STREAM raises SocketError when using IPPROTO_FRAGMENT FAILED
-Expected SocketError
-but no exception was raised (#<Addrinfo: 127.0.0.1:80 SOCK_STREAM IPPROTO_FRAGMENT (hostname)> was returned)
-/export/home/rubyci/chkbuild-tmp/tmp/build/<buildtime>/ruby/spec/ruby/library/socket/addrinfo/initialize_spec.rb:<line_d>:in `block (7 levels) in <top (required)>'
-/export/home/rubyci/chkbuild-tmp/tmp/build/<buildtime>/ruby/spec/ruby/library/socket/addrinfo/initialize_spec.rb:<line_a>:in `<top (required)>'
 
  <n>)
-Addrinfo#initialize using an Array with extra arguments with the AF_INET address family and an explicit socket protocol and the socket type is set to SOCK_STREAM raises SocketError when using IPPROTO_ICMPV6 FAILED
-Expected SocketError
-but no exception was raised (#<Addrinfo: 127.0.0.1:80 SOCK_STREAM IPPROTO_ICMPV6 (hostname)> was returned)
-/export/home/rubyci/chkbuild-tmp/tmp/build/<buildtime>/ruby/spec/ruby/library/socket/addrinfo/initialize_spec.rb:<line_d>:in `block (7 levels) in <top (required)>'
-/export/home/rubyci/chkbuild-tmp/tmp/build/<buildtime>/ruby/spec/ruby/library/socket/addrinfo/initialize_spec.rb:<line_a>:in `<top (required)>'
 
  <n>)
-Addrinfo#initialize using an Array with extra arguments with the AF_INET address family and an explicit socket protocol and the socket type is set to SOCK_STREAM raises SocketError when using IPPROTO_IPV6 FAILED
-Expected SocketError
-but no exception was raised (#<Addrinfo: 127.0.0.1:80 SOCK_STREAM IPPROTO_IPV6 (hostname)> was returned)
-/export/home/rubyci/chkbuild-tmp/tmp/build/<buildtime>/ruby/spec/ruby/library/socket/addrinfo/initialize_spec.rb:<line_d>:in `block (7 levels) in <top (required)>'
-/export/home/rubyci/chkbuild-tmp/tmp/build/<buildtime>/ruby/spec/ruby/library/socket/addrinfo/initialize_spec.rb:<line_a>:in `<top (required)>'
 
  <n>)
-Addrinfo#initialize using an Array with extra arguments with the AF_INET address family and an explicit socket protocol and the socket type is set to SOCK_STREAM raises SocketError when using IPPROTO_NONE FAILED
-Expected SocketError
-but no exception was raised (#<Addrinfo: 127.0.0.1:80 SOCK_STREAM IPPROTO_NONE (hostname)> was returned)
-/export/home/rubyci/chkbuild-tmp/tmp/build/<buildtime>/ruby/spec/ruby/library/socket/addrinfo/initialize_spec.rb:<line_d>:in `block (7 levels) in <top (required)>'
-/export/home/rubyci/chkbuild-tmp/tmp/build/<buildtime>/ruby/spec/ruby/library/socket/addrinfo/initialize_spec.rb:<line_a>:in `<top (required)>'
 
  <n>)
-Addrinfo#initialize using an Array with extra arguments with the AF_INET address family and an explicit socket protocol and the socket type is set to SOCK_STREAM raises SocketError when using IPPROTO_ROUTING FAILED
-Expected SocketError
-but no exception was raised (#<Addrinfo: 127.0.0.1:80 SOCK_STREAM IPPROTO_ROUTING (hostname)> was returned)
-/export/home/rubyci/chkbuild-tmp/tmp/build/<buildtime>/ruby/spec/ruby/library/socket/addrinfo/initialize_spec.rb:<line_d>:in `block (7 levels) in <top (required)>'
-/export/home/rubyci/chkbuild-tmp/tmp/build/<buildtime>/ruby/spec/ruby/library/socket/addrinfo/initialize_spec.rb:<line_a>:in `<top (required)>'
 
  <n>)
-Addrinfo#initialize using an Array with extra arguments with the AF_INET address family and an explicit socket protocol and the socket type is set to SOCK_STREAM raises SocketError when using IPPROTO_RAW FAILED
-Expected SocketError
-but no exception was raised (#<Addrinfo: 127.0.0.1:80 SOCK_STREAM IPPROTO_RAW (hostname)> was returned)
-/export/home/rubyci/chkbuild-tmp/tmp/build/<buildtime>/ruby/spec/ruby/library/socket/addrinfo/initialize_spec.rb:<line_d>:in `block (7 levels) in <top (required)>'
-/export/home/rubyci/chkbuild-tmp/tmp/build/<buildtime>/ruby/spec/ruby/library/socket/addrinfo/initialize_spec.rb:<line_a>:in `<top (required)>'
 
  <n>)
-Addrinfo#initialize using an Array with extra arguments with the AF_INET address family and an explicit socket protocol and the socket type is set to SOCK_STREAM raises SocketError when using IPPROTO_MAX FAILED
-Expected SocketError
-but no exception was raised (#<Addrinfo: 127.0.0.1:80 SOCK_STREAM IPPROTO_MAX (hostname)> was returned)
-/export/home/rubyci/chkbuild-tmp/tmp/build/<buildtime>/ruby/spec/ruby/library/socket/addrinfo/initialize_spec.rb:<line_d>:in `block (7 levels) in <top (required)>'
-/export/home/rubyci/chkbuild-tmp/tmp/build/<buildtime>/ruby/spec/ruby/library/socket/addrinfo/initialize_spec.rb:<line_a>:in `<top (required)>'
 
  <n>)
-Socket::Constants defines SCM options FAILED
-Expected Socket::Constants to have constant 'SCM_CREDENTIALS' but it does not
-/export/home/rubyci/chkbuild-tmp/tmp/build/<buildtime>/ruby/spec/ruby/library/socket/constants/constants_spec.rb:<line_a>:in `block (4 levels) in <top (required)>'
-/export/home/rubyci/chkbuild-tmp/tmp/build/<buildtime>/ruby/spec/ruby/library/socket/constants/constants_spec.rb:<line_a>:in `block (3 levels) in <top (required)>'
-/export/home/rubyci/chkbuild-tmp/tmp/build/<buildtime>/ruby/spec/ruby/library/socket/constants/constants_spec.rb:<line_a>:in `<top (required)>'
 
  <n>)
-An exception occurred during: before :each
-Socket#accept_nonblock using IPv4 using a bound socket that's listening with a connected client the returned Addrinfo uses 0 as the protocol ERROR
-IO::EAGAINWaitReadable: Resource temporarily unavailable - accept(2) would block
-/export/home/rubyci/chkbuild-tmp/tmp/build/<buildtime>/ruby/.ext/common/socket.rb:<line_a>:in `__accept_nonblock'
-/export/home/rubyci/chkbuild-tmp/tmp/build/<buildtime>/ruby/.ext/common/socket.rb:<line_a>:in `accept_nonblock'
-/export/home/rubyci/chkbuild-tmp/tmp/build/<buildtime>/ruby/spec/ruby/library/socket/socket/accept_nonblock_spec.rb:<line_a>:in `block (7 levels) in <top (required)>'
-/export/home/rubyci/chkbuild-tmp/tmp/build/<buildtime>/ruby/spec/ruby/library/socket/socket/accept_nonblock_spec.rb:<line_a>:in `<top (required)>'
 
  <n>)
-Socket.getaddrinfo without global reverse lookups returns an Array ERROR
-SocketError: getaddrinfo: service name not available for the specified socket type
-/export/home/rubyci/chkbuild-tmp/tmp/build/<buildtime>/ruby/spec/ruby/library/socket/socket/getaddrinfo_spec.rb:<line_a>:in `getaddrinfo'
-/export/home/rubyci/chkbuild-tmp/tmp/build/<buildtime>/ruby/spec/ruby/library/socket/socket/getaddrinfo_spec.rb:<line_a>:in `block (3 levels) in <top (required)>'
-/export/home/rubyci/chkbuild-tmp/tmp/build/<buildtime>/ruby/spec/ruby/library/socket/socket/getaddrinfo_spec.rb:<line_a>:in `<top (required)>'
 
  <n>)
-Socket.getaddrinfo without global reverse lookups accepts a Fixnum as the address family ERROR
-SocketError: getaddrinfo: service name not available for the specified socket type
-/export/home/rubyci/chkbuild-tmp/tmp/build/<buildtime>/ruby/spec/ruby/library/socket/socket/getaddrinfo_spec.rb:<line_b>:in `getaddrinfo'
-/export/home/rubyci/chkbuild-tmp/tmp/build/<buildtime>/ruby/spec/ruby/library/socket/socket/getaddrinfo_spec.rb:<line_b>:in `block (3 levels) in <top (required)>'
-/export/home/rubyci/chkbuild-tmp/tmp/build/<buildtime>/ruby/spec/ruby/library/socket/socket/getaddrinfo_spec.rb:<line_a>:in `<top (required)>'
 
  <n>)
-Socket.getaddrinfo without global reverse lookups accepts a Fixnum as the address family using IPv6 ERROR
-SocketError: getaddrinfo: service name not available for the specified socket type
-/export/home/rubyci/chkbuild-tmp/tmp/build/<buildtime>/ruby/spec/ruby/library/socket/socket/getaddrinfo_spec.rb:<line_c>:in `getaddrinfo'
-/export/home/rubyci/chkbuild-tmp/tmp/build/<buildtime>/ruby/spec/ruby/library/socket/socket/getaddrinfo_spec.rb:<line_c>:in `block (3 levels) in <top (required)>'
-/export/home/rubyci/chkbuild-tmp/tmp/build/<buildtime>/ruby/spec/ruby/library/socket/socket/getaddrinfo_spec.rb:<line_a>:in `<top (required)>'
 
  <n>)
-Socket.getaddrinfo without global reverse lookups accepts a Symbol as the address family ERROR
-SocketError: getaddrinfo: service name not available for the specified socket type
-/export/home/rubyci/chkbuild-tmp/tmp/build/<buildtime>/ruby/spec/ruby/library/socket/socket/getaddrinfo_spec.rb:<line_d>:in `getaddrinfo'
-/export/home/rubyci/chkbuild-tmp/tmp/build/<buildtime>/ruby/spec/ruby/library/socket/socket/getaddrinfo_spec.rb:<line_d>:in `block (3 levels) in <top (required)>'
-/export/home/rubyci/chkbuild-tmp/tmp/build/<buildtime>/ruby/spec/ruby/library/socket/socket/getaddrinfo_spec.rb:<line_a>:in `<top (required)>'
 
  <n>)
-Socket.getaddrinfo without global reverse lookups accepts a Symbol as the address family using IPv6 ERROR
-SocketError: getaddrinfo: service name not available for the specified socket type
-/export/home/rubyci/chkbuild-tmp/tmp/build/<buildtime>/ruby/spec/ruby/library/socket/socket/getaddrinfo_spec.rb:<line_e>:in `getaddrinfo'
-/export/home/rubyci/chkbuild-tmp/tmp/build/<buildtime>/ruby/spec/ruby/library/socket/socket/getaddrinfo_spec.rb:<line_e>:in `block (3 levels) in <top (required)>'
-/export/home/rubyci/chkbuild-tmp/tmp/build/<buildtime>/ruby/spec/ruby/library/socket/socket/getaddrinfo_spec.rb:<line_a>:in `<top (required)>'
 
  <n>)
-Socket.getaddrinfo without global reverse lookups accepts a String as the address family ERROR
-SocketError: getaddrinfo: service name not available for the specified socket type
-/export/home/rubyci/chkbuild-tmp/tmp/build/<buildtime>/ruby/spec/ruby/library/socket/socket/getaddrinfo_spec.rb:<line_f>:in `getaddrinfo'
-/export/home/rubyci/chkbuild-tmp/tmp/build/<buildtime>/ruby/spec/ruby/library/socket/socket/getaddrinfo_spec.rb:<line_f>:in `block (3 levels) in <top (required)>'
-/export/home/rubyci/chkbuild-tmp/tmp/build/<buildtime>/ruby/spec/ruby/library/socket/socket/getaddrinfo_spec.rb:<line_a>:in `<top (required)>'
 
  <n>)
-Socket.getaddrinfo without global reverse lookups accepts a String as the address family using IPv6 ERROR
-SocketError: getaddrinfo: service name not available for the specified socket type
-/export/home/rubyci/chkbuild-tmp/tmp/build/<buildtime>/ruby/spec/ruby/library/socket/socket/getaddrinfo_spec.rb:<line_g>:in `getaddrinfo'
-/export/home/rubyci/chkbuild-tmp/tmp/build/<buildtime>/ruby/spec/ruby/library/socket/socket/getaddrinfo_spec.rb:<line_g>:in `block (3 levels) in <top (required)>'
-/export/home/rubyci/chkbuild-tmp/tmp/build/<buildtime>/ruby/spec/ruby/library/socket/socket/getaddrinfo_spec.rb:<line_a>:in `<top (required)>'
 
  <n>)
-Socket.getaddrinfo without global reverse lookups accepts an object responding to #to_str as the host ERROR
-SocketError: getaddrinfo: service name not available for the specified socket type
-/export/home/rubyci/chkbuild-tmp/tmp/build/<buildtime>/ruby/spec/ruby/library/socket/socket/getaddrinfo_spec.rb:<line_h>:in `getaddrinfo'
-/export/home/rubyci/chkbuild-tmp/tmp/build/<buildtime>/ruby/spec/ruby/library/socket/socket/getaddrinfo_spec.rb:<line_h>:in `block (3 levels) in <top (required)>'
-/export/home/rubyci/chkbuild-tmp/tmp/build/<buildtime>/ruby/spec/ruby/library/socket/socket/getaddrinfo_spec.rb:<line_a>:in `<top (required)>'
 
  <n>)
-Socket.getaddrinfo without global reverse lookups accepts an object responding to #to_str as the address family ERROR
-SocketError: getaddrinfo: service name not available for the specified socket type
-/export/home/rubyci/chkbuild-tmp/tmp/build/<buildtime>/ruby/spec/ruby/library/socket/socket/getaddrinfo_spec.rb:<line_i>:in `getaddrinfo'
-/export/home/rubyci/chkbuild-tmp/tmp/build/<buildtime>/ruby/spec/ruby/library/socket/socket/getaddrinfo_spec.rb:<line_i>:in `block (3 levels) in <top (required)>'
-/export/home/rubyci/chkbuild-tmp/tmp/build/<buildtime>/ruby/spec/ruby/library/socket/socket/getaddrinfo_spec.rb:<line_a>:in `<top (required)>'
 
  <n>)
-Socket.getaddrinfo without global reverse lookups accepts a Fixnum as the socket type ERROR
-SocketError: getaddrinfo: service name not available for the specified socket type
-/export/home/rubyci/chkbuild-tmp/tmp/build/<buildtime>/ruby/spec/ruby/library/socket/socket/getaddrinfo_spec.rb:<line_j>:in `getaddrinfo'
-/export/home/rubyci/chkbuild-tmp/tmp/build/<buildtime>/ruby/spec/ruby/library/socket/socket/getaddrinfo_spec.rb:<line_j>:in `block (3 levels) in <top (required)>'
-/export/home/rubyci/chkbuild-tmp/tmp/build/<buildtime>/ruby/spec/ruby/library/socket/socket/getaddrinfo_spec.rb:<line_a>:in `<top (required)>'
 
  <n>)
-Socket.getaddrinfo without global reverse lookups accepts a Symbol as the socket type ERROR
-SocketError: getaddrinfo: service name not available for the specified socket type
-/export/home/rubyci/chkbuild-tmp/tmp/build/<buildtime>/ruby/spec/ruby/library/socket/socket/getaddrinfo_spec.rb:<line_k>:in `getaddrinfo'
-/export/home/rubyci/chkbuild-tmp/tmp/build/<buildtime>/ruby/spec/ruby/library/socket/socket/getaddrinfo_spec.rb:<line_k>:in `block (3 levels) in <top (required)>'
-/export/home/rubyci/chkbuild-tmp/tmp/build/<buildtime>/ruby/spec/ruby/library/socket/socket/getaddrinfo_spec.rb:<line_a>:in `<top (required)>'
 
  <n>)
-Socket.getaddrinfo without global reverse lookups accepts a String as the socket type ERROR
-SocketError: getaddrinfo: service name not available for the specified socket type
-/export/home/rubyci/chkbuild-tmp/tmp/build/<buildtime>/ruby/spec/ruby/library/socket/socket/getaddrinfo_spec.rb:<line_l>:in `getaddrinfo'
-/export/home/rubyci/chkbuild-tmp/tmp/build/<buildtime>/ruby/spec/ruby/library/socket/socket/getaddrinfo_spec.rb:<line_l>:in `block (3 levels) in <top (required)>'
-/export/home/rubyci/chkbuild-tmp/tmp/build/<buildtime>/ruby/spec/ruby/library/socket/socket/getaddrinfo_spec.rb:<line_a>:in `<top (required)>'
 
  <n>)
-Socket.getaddrinfo without global reverse lookups accepts an object responding to #to_str as the socket type ERROR
-SocketError: getaddrinfo: service name not available for the specified socket type
-/export/home/rubyci/chkbuild-tmp/tmp/build/<buildtime>/ruby/spec/ruby/library/socket/socket/getaddrinfo_spec.rb:<line_m>:in `getaddrinfo'
-/export/home/rubyci/chkbuild-tmp/tmp/build/<buildtime>/ruby/spec/ruby/library/socket/socket/getaddrinfo_spec.rb:<line_m>:in `block (3 levels) in <top (required)>'
-/export/home/rubyci/chkbuild-tmp/tmp/build/<buildtime>/ruby/spec/ruby/library/socket/socket/getaddrinfo_spec.rb:<line_a>:in `<top (required)>'
 
  <n>)
-Socket.getaddrinfo without global reverse lookups accepts a Fixnum as the flags ERROR
-SocketError: getaddrinfo: service name not available for the specified socket type
-/export/home/rubyci/chkbuild-tmp/tmp/build/<buildtime>/ruby/spec/ruby/library/socket/socket/getaddrinfo_spec.rb:<line_n>:in `getaddrinfo'
-/export/home/rubyci/chkbuild-tmp/tmp/build/<buildtime>/ruby/spec/ruby/library/socket/socket/getaddrinfo_spec.rb:<line_n>:in `block (3 levels) in <top (required)>'
-/export/home/rubyci/chkbuild-tmp/tmp/build/<buildtime>/ruby/spec/ruby/library/socket/socket/getaddrinfo_spec.rb:<line_a>:in `<top (required)>'
 
  <n>)
-Socket.getaddrinfo without global reverse lookups performs a reverse lookup when the reverse_lookup argument is true ERROR
-SocketError: getaddrinfo: service name not available for the specified socket type
-/export/home/rubyci/chkbuild-tmp/tmp/build/<buildtime>/ruby/spec/ruby/library/socket/socket/getaddrinfo_spec.rb:<line_o>:in `getaddrinfo'
-/export/home/rubyci/chkbuild-tmp/tmp/build/<buildtime>/ruby/spec/ruby/library/socket/socket/getaddrinfo_spec.rb:<line_o>:in `block (3 levels) in <top (required)>'
-/export/home/rubyci/chkbuild-tmp/tmp/build/<buildtime>/ruby/spec/ruby/library/socket/socket/getaddrinfo_spec.rb:<line_a>:in `<top (required)>'
 
  <n>)
-Socket.getaddrinfo without global reverse lookups performs a reverse lookup when the reverse_lookup argument is :hostname ERROR
-SocketError: getaddrinfo: service name not available for the specified socket type
-/export/home/rubyci/chkbuild-tmp/tmp/build/<buildtime>/ruby/spec/ruby/library/socket/socket/getaddrinfo_spec.rb:<line_p>:in `getaddrinfo'
-/export/home/rubyci/chkbuild-tmp/tmp/build/<buildtime>/ruby/spec/ruby/library/socket/socket/getaddrinfo_spec.rb:<line_p>:in `block (3 levels) in <top (required)>'
-/export/home/rubyci/chkbuild-tmp/tmp/build/<buildtime>/ruby/spec/ruby/library/socket/socket/getaddrinfo_spec.rb:<line_a>:in `<top (required)>'
 
  <n>)
-Socket.getaddrinfo without global reverse lookups performs a reverse lookup when the reverse_lookup argument is :numeric ERROR
-SocketError: getaddrinfo: service name not available for the specified socket type
-/export/home/rubyci/chkbuild-tmp/tmp/build/<buildtime>/ruby/spec/ruby/library/socket/socket/getaddrinfo_spec.rb:<line_q>:in `getaddrinfo'
-/export/home/rubyci/chkbuild-tmp/tmp/build/<buildtime>/ruby/spec/ruby/library/socket/socket/getaddrinfo_spec.rb:<line_q>:in `block (3 levels) in <top (required)>'
-/export/home/rubyci/chkbuild-tmp/tmp/build/<buildtime>/ruby/spec/ruby/library/socket/socket/getaddrinfo_spec.rb:<line_a>:in `<top (required)>'
 
  <n>)
-Socket.getaddrinfo with global reverse lookups returns an address honoring the global lookup option ERROR
-SocketError: getaddrinfo: service name not available for the specified socket type
-/export/home/rubyci/chkbuild-tmp/tmp/build/<buildtime>/ruby/spec/ruby/library/socket/socket/getaddrinfo_spec.rb:<line_r>:in `getaddrinfo'
-/export/home/rubyci/chkbuild-tmp/tmp/build/<buildtime>/ruby/spec/ruby/library/socket/socket/getaddrinfo_spec.rb:<line_r>:in `block (3 levels) in <top (required)>'
-/export/home/rubyci/chkbuild-tmp/tmp/build/<buildtime>/ruby/spec/ruby/library/socket/socket/getaddrinfo_spec.rb:<line_a>:in `<top (required)>'
 
  <n>)
-Socket.gethostbyaddr using an IPv4 address without an explicit address family the returned Array includes the hostname as the first value FAILED
-Expected "localhost"
- to equal "unstable11x"
 
-/export/home/rubyci/chkbuild-tmp/tmp/build/<buildtime>/ruby/spec/ruby/library/socket/socket/gethostbyaddr_spec.rb:<line_a>:in `block (5 levels) in <top (required)>'
-/export/home/rubyci/chkbuild-tmp/tmp/build/<buildtime>/ruby/spec/ruby/library/socket/socket/gethostbyaddr_spec.rb:<line_a>:in `<top (required)>'
 
  <n>)
-Socket.getnameinfo using a String as the first argument without custom flags returns an Array containing the hostname and service name FAILED
-Expected ["unstable11x", "80"]
- to equal ["unstable11x", "http"]
 
-/export/home/rubyci/chkbuild-tmp/tmp/build/<buildtime>/ruby/spec/ruby/library/socket/socket/getnameinfo_spec.rb:<line_a>:in `block (4 levels) in <top (required)>'
-/export/home/rubyci/chkbuild-tmp/tmp/build/<buildtime>/ruby/spec/ruby/library/socket/socket/getnameinfo_spec.rb:<line_a>:in `<top (required)>'
 
  <n>)
-Socket.getnameinfo using a String as the first argument using NI_NUMERICHOST as the flag returns an Array containing the numeric hostname and service name FAILED
-Expected "80"
- to equal "http"
 
-/export/home/rubyci/chkbuild-tmp/tmp/build/<buildtime>/ruby/spec/ruby/library/socket/socket/getnameinfo_spec.rb:<line_b>:in `block (4 levels) in <top (required)>'
-/export/home/rubyci/chkbuild-tmp/tmp/build/<buildtime>/ruby/spec/ruby/library/socket/socket/getnameinfo_spec.rb:<line_a>:in `<top (required)>'
 
  <n>)
-Socket.getnameinfo using IPv4 using a 3 element Array as the first argument without custom flags returns an Array containing the hostname and service name FAILED
-Expected "80"
- to equal "http"
 
-/export/home/rubyci/chkbuild-tmp/tmp/build/<buildtime>/ruby/spec/ruby/library/socket/socket/getnameinfo_spec.rb:<line_a>:in `block (5 levels) in <top (required)>'
-/export/home/rubyci/chkbuild-tmp/tmp/build/<buildtime>/ruby/spec/ruby/library/socket/socket/getnameinfo_spec.rb:<line_a>:in `<top (required)>'
 
  <n>)
-Socket.getnameinfo using IPv4 using a 3 element Array as the first argument using NI_NUMERICHOST as the flag returns an Array containing the numeric hostname and service name FAILED
-Expected ["127.0.0.1", "80"]
- to equal ["127.0.0.1", "http"]
 
-/export/home/rubyci/chkbuild-tmp/tmp/build/<buildtime>/ruby/spec/ruby/library/socket/socket/getnameinfo_spec.rb:<line_a>:in `block (6 levels) in <top (required)>'
-/export/home/rubyci/chkbuild-tmp/tmp/build/<buildtime>/ruby/spec/ruby/library/socket/socket/getnameinfo_spec.rb:<line_a>:in `<top (required)>'
 
  <n>)
-Socket.getnameinfo using IPv4 using a 4 element Array as the first argument without custom flags returns an Array containing the hostname and service name FAILED
-Expected "80"
- to equal "http"
 
-/export/home/rubyci/chkbuild-tmp/tmp/build/<buildtime>/ruby/spec/ruby/library/socket/socket/getnameinfo_spec.rb:<line_b>:in `block (5 levels) in <top (required)>'
-/export/home/rubyci/chkbuild-tmp/tmp/build/<buildtime>/ruby/spec/ruby/library/socket/socket/getnameinfo_spec.rb:<line_a>:in `<top (required)>'
 
  <n>)
-Socket.getnameinfo using IPv4 using a 4 element Array as the first argument without custom flags uses the 3rd value as the hostname if the 4th is not present FAILED
-Expected "80"
- to equal "http"
 
-/export/home/rubyci/chkbuild-tmp/tmp/build/<buildtime>/ruby/spec/ruby/library/socket/socket/getnameinfo_spec.rb:<line_c>:in `block (5 levels) in <top (required)>'
-/export/home/rubyci/chkbuild-tmp/tmp/build/<buildtime>/ruby/spec/ruby/library/socket/socket/getnameinfo_spec.rb:<line_a>:in `<top (required)>'
 
  <n>)
-Socket.getnameinfo using IPv4 using a 4 element Array as the first argument using NI_NUMERICHOST as the flag returns an Array containing the numeric hostname and service name FAILED
-Expected ["127.0.0.1", "80"]
- to equal ["127.0.0.1", "http"]
 
-/export/home/rubyci/chkbuild-tmp/tmp/build/<buildtime>/ruby/spec/ruby/library/socket/socket/getnameinfo_spec.rb:<line_d>:in `block (5 levels) in <top (required)>'
-/export/home/rubyci/chkbuild-tmp/tmp/build/<buildtime>/ruby/spec/ruby/library/socket/socket/getnameinfo_spec.rb:<line_a>:in `<top (required)>'
 
  <n>)
-Socket.getnameinfo using IPv6 using a 3 element Array as the first argument without custom flags returns an Array containing the hostname and service name FAILED
-Expected "80"
- to equal "http"
 
-/export/home/rubyci/chkbuild-tmp/tmp/build/<buildtime>/ruby/spec/ruby/library/socket/socket/getnameinfo_spec.rb:<line_a>:in `block (5 levels) in <top (required)>'
-/export/home/rubyci/chkbuild-tmp/tmp/build/<buildtime>/ruby/spec/ruby/library/socket/socket/getnameinfo_spec.rb:<line_a>:in `<top (required)>'
 
  <n>)
-Socket.getnameinfo using IPv6 using a 3 element Array as the first argument using NI_NUMERICHOST as the flag returns an Array containing the numeric hostname and service name FAILED
-Expected ["::1", "80"]
- to equal ["::1", "http"]
 
-/export/home/rubyci/chkbuild-tmp/tmp/build/<buildtime>/ruby/spec/ruby/library/socket/socket/getnameinfo_spec.rb:<line_a>:in `block (6 levels) in <top (required)>'
-/export/home/rubyci/chkbuild-tmp/tmp/build/<buildtime>/ruby/spec/ruby/library/socket/socket/getnameinfo_spec.rb:<line_a>:in `<top (required)>'
 
  <n>)
-Socket.getnameinfo using IPv6 using a 4 element Array as the first argument without custom flags returns an Array containing the hostname and service name FAILED
-Expected "80"
- to equal "http"
 
-/export/home/rubyci/chkbuild-tmp/tmp/build/<buildtime>/ruby/spec/ruby/library/socket/socket/getnameinfo_spec.rb:<line_b>:in `block (5 levels) in <top (required)>'
-/export/home/rubyci/chkbuild-tmp/tmp/build/<buildtime>/ruby/spec/ruby/library/socket/socket/getnameinfo_spec.rb:<line_a>:in `<top (required)>'
 
  <n>)
-Socket.getnameinfo using IPv6 using a 4 element Array as the first argument without custom flags uses the 3rd value as the hostname if the 4th is not present FAILED
-Expected "80"
- to equal "http"
 
-/export/home/rubyci/chkbuild-tmp/tmp/build/<buildtime>/ruby/spec/ruby/library/socket/socket/getnameinfo_spec.rb:<line_c>:in `block (5 levels) in <top (required)>'
-/export/home/rubyci/chkbuild-tmp/tmp/build/<buildtime>/ruby/spec/ruby/library/socket/socket/getnameinfo_spec.rb:<line_a>:in `<top (required)>'
 
  <n>)
-Socket.getnameinfo using IPv6 using a 4 element Array as the first argument using NI_NUMERICHOST as the flag returns an Array containing the numeric hostname and service name FAILED
-Expected ["::1", "80"]
- to equal ["::1", "http"]
 
-/export/home/rubyci/chkbuild-tmp/tmp/build/<buildtime>/ruby/spec/ruby/library/socket/socket/getnameinfo_spec.rb:<line_d>:in `block (5 levels) in <top (required)>'
-/export/home/rubyci/chkbuild-tmp/tmp/build/<buildtime>/ruby/spec/ruby/library/socket/socket/getnameinfo_spec.rb:<line_a>:in `<top (required)>'
 
  <n>)
-Socket#getservbyname returns the port for service "http" ERROR
-SocketError: no such service http/tcp
-/export/home/rubyci/chkbuild-tmp/tmp/build/<buildtime>/ruby/spec/ruby/library/socket/socket/getservbyname_spec.rb:<line_a>:in `getservbyname'
-/export/home/rubyci/chkbuild-tmp/tmp/build/<buildtime>/ruby/spec/ruby/library/socket/socket/getservbyname_spec.rb:<line_a>:in `block (2 levels) in <top (required)>'
-/export/home/rubyci/chkbuild-tmp/tmp/build/<buildtime>/ruby/spec/ruby/library/socket/socket/getservbyname_spec.rb:<line_a>:in `<top (required)>'
 
  <n>)
-Socket#getservbyname returns the port for service "http" with protocol "tcp" ERROR
-SocketError: no such service http/tcp
-/export/home/rubyci/chkbuild-tmp/tmp/build/<buildtime>/ruby/spec/ruby/library/socket/socket/getservbyname_spec.rb:<line_b>:in `getservbyname'
-/export/home/rubyci/chkbuild-tmp/tmp/build/<buildtime>/ruby/spec/ruby/library/socket/socket/getservbyname_spec.rb:<line_b>:in `block (2 levels) in <top (required)>'
-/export/home/rubyci/chkbuild-tmp/tmp/build/<buildtime>/ruby/spec/ruby/library/socket/socket/getservbyname_spec.rb:<line_a>:in `<top (required)>'
 
  <n>)
-Socket#pack_sockaddr_in using an IPv6 address returns a String of 28 bytes FAILED
-Expected 32
- to equal 28
 
-/export/home/rubyci/chkbuild-tmp/tmp/build/<buildtime>/ruby/spec/ruby/library/socket/shared/pack_sockaddr.rb:<line_a>:in `block (3 levels) in <top (required)>'
-/export/home/rubyci/chkbuild-tmp/tmp/build/<buildtime>/ruby/spec/ruby/library/socket/socket/pack_sockaddr_in_spec.rb:<line_a>:in `<top (required)>'
 
  <n>)
-Socket#sockaddr_in using an IPv6 address returns a String of 28 bytes FAILED
-Expected 32
- to equal 28
 
-/export/home/rubyci/chkbuild-tmp/tmp/build/<buildtime>/ruby/spec/ruby/library/socket/shared/pack_sockaddr.rb:<line_a>:in `block (3 levels) in <top (required)>'
-/export/home/rubyci/chkbuild-tmp/tmp/build/<buildtime>/ruby/spec/ruby/library/socket/socket/sockaddr_in_spec.rb:<line_a>:in `<top (required)>'
 
 Finished in <t> seconds
 
 <num> files, <num> examples, <num> expectations, <num> failures, <num> errors, <num> tagged
-gmake: *** [uncommon.mk:774: yes-test-spec] Error 1
 exit 2
 failed(rubyspec)
 == dist # <time>
@@ 79655 @@
 /home/rubyci/unstable10x/ruby_2_3/bin/ruby --disable=gems ./tool/make-snapshot \
 -srcdir=. -packages=gzip,zip,all \
 -unicode-version=10.0.0 \
-tmp trunk@64257
 Exporting trunk@<rev>
-svn: E170013: Unable to connect to a repository at URL 'http://svn.ruby-lang.org/repos/ruby/trunk'
-svn: E175002: Unexpected HTTP status 503 'Service Unavailable' on '/repos/ruby/trunk'
-Export failed
-gmake: *** [uncommon.mk:1157: dist] Error 1
 exit 2
-failed(dist)
 == end # <time>
 <elapsed time>

OlderDiff < 20180809T202406Z(failure) < ThisDiff > 20180810T112409Z(failure) > NewerDiff


chkbuild summary recent last