r63014 ruby 2.3.7p456 (2018-03-28) [i686-linux] [2.3] (boron) 309W 4F1E rubyspec:8F2E

chkbuild summary recent last

20180808T184855Z(failure) < OlderDiff < 20180809T180941Z(failure) > NewerDiff > 20180810T180756Z(failure)

== test-all # 2018-08-10T03:28:30+09:00 (full)
...(snip 16651 lines)...
XMLRPC::ClientTest#test_new2_proxy_port = 0.00 s = .
XMLRPC::ClientTest#test_new2_slash_path = 0.00 s = .
XMLRPC::ClientTest#test_new2_ssl = 0.00 s = .
XMLRPC::ClientTest#test_new2_ssl_custom_port = 0.00 s = .
XMLRPC::ClientTest#test_new2_user_password = 0.00 s = .
XMLRPC::ClientTest#test_request = 0.01 s = .


Finished tests in 759.434600s, 21.3870 tests/s, 2951.0889 assertions/s.

  1) Failure:
TestTimeTZ#test_gen_Pacific_Kiritimati_71 [/extdisk/chkbuild/chkbuild/tmp/build/20180809T180941Z/ruby/test/ruby/test_time_tz.rb:265]:
TZ=Pacific/Kiritimati Time.utc(1995, 1, 1, 9, 59, 59).localtime.
<"1994-12-31 23:59:59 -1000"> expected but was
<"1995-01-01 23:59:59 +1400">.

  2) Failure:
TestTimeTZ#test_gen_Pacific_Kiritimati_89 [/extdisk/chkbuild/chkbuild/tmp/build/20180809T180941Z/ruby/test/ruby/test_time_tz.rb:283]:
TZ=Pacific/Kiritimati Time.local(1994, 12, 31, 23, 59, 59).
<"1994-12-31 23:59:59 -1000"> expected but was
<"1995-01-01 23:59:59 +1400">.

  3) Failure:
TestTimeTZ#test_gen_lisbon_99 [/extdisk/chkbuild/chkbuild/tmp/build/20180809T180941Z/ruby/test/ruby/test_time_tz.rb:408]:
Expected [[false, false, false, false, false], [false, false, false, false, false]] to include [true, true, true, true, true].

  4) Failure:
TestTimeTZ#test_pacific_kiritimati [/extdisk/chkbuild/chkbuild/tmp/build/20180809T180941Z/ruby/test/ruby/test_time_tz.rb:181]:
TZ=Pacific/Kiritimati Time.local(1994, 12, 31, 23, 59, 59).
<"1994-12-31 23:59:59 -1000"> expected but was
<"1995-01-01 23:59:59 +1400">.

  5) Error:
Net::TestSMTP#test_tls_connect:
Net::OpenTimeout: Net::OpenTimeout
    /extdisk/chkbuild/chkbuild/tmp/build/20180809T180941Z/ruby/lib/net/protocol.rb:41:in `ssl_socket_connect'
    /extdisk/chkbuild/chkbuild/tmp/build/20180809T180941Z/ruby/lib/net/smtp.rb:587:in `tlsconnect'
    /extdisk/chkbuild/chkbuild/tmp/build/20180809T180941Z/ruby/lib/net/smtp.rb:555:in `do_start'
    /extdisk/chkbuild/chkbuild/tmp/build/20180809T180941Z/ruby/lib/net/smtp.rb:521:in `start'
    /extdisk/chkbuild/chkbuild/tmp/build/20180809T180941Z/ruby/test/net/smtp/test_smtp.rb:132:in `test_tls_connect'

16242 tests, 2241159 assertions, 4 failures, 1 errors, 46 skips

ruby -v: ruby 2.3.7p456 (2018-03-28 revision 63014) [i686-linux]
make: *** [yes-test-all] Error 5
exit 2
failed(test-all)
== rubyspec # 2018-08-10T03:41:24+09:00 (full)
...(snip 48756 lines)...
- UNIXServer.open by raising an exception when there is a NUL byte
- UNIXSocket.open by raising an exception when there is a NUL byte

/extdisk/chkbuild/chkbuild/tmp/build/20180809T180941Z/rubyspec/security/cve_2018_8780_spec.rb                                             
CVE-2018-8780 is resisted by
- Dir.glob by raising an exception when there is a NUL byte
- Dir.entries by raising an exception when there is a NUL byte
- Dir.foreach by raising an exception when there is a NUL byte


1)
Addrinfo.getaddrinfo sets a custom protocol family of the Addrinfo instances ERROR
SocketError: getaddrinfo: Name or service not known
/extdisk/chkbuild/chkbuild/tmp/build/20180809T180941Z/rubyspec/library/socket/addrinfo/getaddrinfo_spec.rb:40:in `getaddrinfo'
/extdisk/chkbuild/chkbuild/tmp/build/20180809T180941Z/rubyspec/library/socket/addrinfo/getaddrinfo_spec.rb:40:in `block (3 levels) in <top (required)>'
/extdisk/chkbuild/chkbuild/tmp/build/20180809T180941Z/rubyspec/library/socket/addrinfo/getaddrinfo_spec.rb:4:in `<top (required)>'

2)
Addrinfo.getaddrinfo sets a corresponding address family based on a custom protocol family ERROR
SocketError: getaddrinfo: Name or service not known
/extdisk/chkbuild/chkbuild/tmp/build/20180809T180941Z/rubyspec/library/socket/addrinfo/getaddrinfo_spec.rb:46:in `getaddrinfo'
/extdisk/chkbuild/chkbuild/tmp/build/20180809T180941Z/rubyspec/library/socket/addrinfo/getaddrinfo_spec.rb:46:in `block (3 levels) in <top (required)>'
/extdisk/chkbuild/chkbuild/tmp/build/20180809T180941Z/rubyspec/library/socket/addrinfo/getaddrinfo_spec.rb:4:in `<top (required)>'

3)
BasicSocket#recvmsg_nonblock using IPv4 using a disconnected socket using a bound socket with data available the returned Array stores the flags at index 2 FAILED
Expected 1073741824 (Bignum) to be an instance of Fixnum
/extdisk/chkbuild/chkbuild/tmp/build/20180809T180941Z/rubyspec/library/socket/basicsocket/recvmsg_nonblock_spec.rb:78:in `block (8 levels) in <top (required)>'
/extdisk/chkbuild/chkbuild/tmp/build/20180809T180941Z/rubyspec/library/socket/basicsocket/recvmsg_nonblock_spec.rb:4:in `<top (required)>'

4)
BasicSocket#recvmsg_nonblock using IPv4 using a connected socket with data available the returned Array stores the flags at index 2 FAILED
Expected 1073741824 (Bignum) to be an instance of Fixnum
/extdisk/chkbuild/chkbuild/tmp/build/20180809T180941Z/rubyspec/library/socket/basicsocket/recvmsg_nonblock_spec.rb:171:in `block (7 levels) in <top (required)>'
/extdisk/chkbuild/chkbuild/tmp/build/20180809T180941Z/rubyspec/library/socket/basicsocket/recvmsg_nonblock_spec.rb:4:in `<top (required)>'

5)
BasicSocket#recvmsg_nonblock using IPv6 using a disconnected socket using a bound socket with data available the returned Array stores the flags at index 2 FAILED
Expected 1073741824 (Bignum) to be an instance of Fixnum
/extdisk/chkbuild/chkbuild/tmp/build/20180809T180941Z/rubyspec/library/socket/basicsocket/recvmsg_nonblock_spec.rb:78:in `block (8 levels) in <top (required)>'
/extdisk/chkbuild/chkbuild/tmp/build/20180809T180941Z/rubyspec/library/socket/basicsocket/recvmsg_nonblock_spec.rb:4:in `<top (required)>'

6)
BasicSocket#recvmsg_nonblock using IPv6 using a connected socket with data available the returned Array stores the flags at index 2 FAILED
Expected 1073741824 (Bignum) to be an instance of Fixnum
/extdisk/chkbuild/chkbuild/tmp/build/20180809T180941Z/rubyspec/library/socket/basicsocket/recvmsg_nonblock_spec.rb:171:in `block (7 levels) in <top (required)>'
/extdisk/chkbuild/chkbuild/tmp/build/20180809T180941Z/rubyspec/library/socket/basicsocket/recvmsg_nonblock_spec.rb:4:in `<top (required)>'

7)
BasicSocket#recvmsg using IPv4 using a disconnected socket using a bound socket with data available the returned Array stores the flags at index 2 FAILED
Expected 1073741824 (Bignum) to be an instance of Fixnum
/extdisk/chkbuild/chkbuild/tmp/build/20180809T180941Z/rubyspec/library/socket/basicsocket/recvmsg_spec.rb:74:in `block (8 levels) in <top (required)>'
/extdisk/chkbuild/chkbuild/tmp/build/20180809T180941Z/rubyspec/library/socket/basicsocket/recvmsg_spec.rb:4:in `<top (required)>'

8)
BasicSocket#recvmsg using IPv4 using a connected socket with data available the returned Array stores the flags at index 2 FAILED
Expected 1073741824 (Bignum) to be an instance of Fixnum
/extdisk/chkbuild/chkbuild/tmp/build/20180809T180941Z/rubyspec/library/socket/basicsocket/recvmsg_spec.rb:164:in `block (7 levels) in <top (required)>'
/extdisk/chkbuild/chkbuild/tmp/build/20180809T180941Z/rubyspec/library/socket/basicsocket/recvmsg_spec.rb:4:in `<top (required)>'

9)
BasicSocket#recvmsg using IPv6 using a disconnected socket using a bound socket with data available the returned Array stores the flags at index 2 FAILED
Expected 1073741824 (Bignum) to be an instance of Fixnum
/extdisk/chkbuild/chkbuild/tmp/build/20180809T180941Z/rubyspec/library/socket/basicsocket/recvmsg_spec.rb:74:in `block (8 levels) in <top (required)>'
/extdisk/chkbuild/chkbuild/tmp/build/20180809T180941Z/rubyspec/library/socket/basicsocket/recvmsg_spec.rb:4:in `<top (required)>'

10)
BasicSocket#recvmsg using IPv6 using a connected socket with data available the returned Array stores the flags at index 2 FAILED
Expected 1073741824 (Bignum) to be an instance of Fixnum
/extdisk/chkbuild/chkbuild/tmp/build/20180809T180941Z/rubyspec/library/socket/basicsocket/recvmsg_spec.rb:164:in `block (7 levels) in <top (required)>'
/extdisk/chkbuild/chkbuild/tmp/build/20180809T180941Z/rubyspec/library/socket/basicsocket/recvmsg_spec.rb:4:in `<top (required)>'

Finished in 122.553501 seconds

3690 files, 29181 examples, 211118 expectations, 8 failures, 2 errors, 0 tagged
exit 1
failed(rubyspec)

20180808T184855Z(failure) < OlderDiff < 20180809T180941Z(failure) > NewerDiff > 20180810T180756Z(failure)


chkbuild summary recent last